{"text_format":"2","workbook":"xlsx","n_sheets":8,"sheets":["Instructions","MainSheet","RaceLists","Meetings","Form","Race","Tables","Data"],"not_rendered":{"charts":0,"images":0,"macros":1,"external_links":0,"defined_names":27,"comments":0,"pivot_tables":0},"unopened":[],"bounds":{"document_bytes":16777216,"sheet_cells":100000,"run_cost":"one","rows_first":2000,"rows_last":500,"rows_between":2000,"halvings":0,"cell_chars":16384,"cell_head_chars":4096},"cells_cut":0,"cells_raw":0,"read":"whole","date_system":"1900"}

{"sheet":"Instructions","index":0,"n_rows":18,"n_cols":5,"rows_kept":18,"cut":false,"hidden":false,"merged":[]}
[]
[]
[{"$nulls":4},"Instructions"]
[]
[{"$nulls":4},"1) On \"MainSheet\" add the hours to subtract in cell U4 for your local time as times are EST or EDST."]
[{"$nulls":4},"2) Go to \"Data\" sheet and press \"Delete\" to clear any old race files."]
[{"$nulls":4},"3) Press the \"Start\" button you can then change the date for back testing your ratings or click \"OK\" for today's races."]
[{"$nulls":4},"4) If you wish to import all races press \"Automatic\" it will take about 30 seconds a race to import just let the sheet run until finished."]
[{"$nulls":4},"5) You can choose to import your choice of races by going to \"RaceLists\" sheet and clearing the race numbers of the races you are not interested in,"]
[{"$nulls":4},"     Then go back to \"Data\" sheet and press the \"Automatic\" button and let the sheet run."]
[{"$nulls":4},"6) If you want to just import a race as you go then on the \"Data\" sheet click on a cell from A3 downwards for the race you want then press \"Manual\"."]
[]
[{"$nulls":4},"Adjust Ratings"]
[]
[{"$nulls":4},"The sheet is unprotected so you can make any changes you want, to add your own values go to the \" Tables\" sheet, if you wish to exclude a form factor  "]
[{"$nulls":4},"from being assessed put an X in the box above that factor."]
[{"$nulls":4},"You can also change any factor in red or even add your own assessment criterior and values if you wish,"]
[{"$nulls":4}," you will need to make major changes if you want to add your own form factors so make a copy of the sheet before you start."]

{"sheet":"MainSheet","index":1,"n_rows":34,"n_cols":22,"rows_kept":34,"cut":false,"hidden":false,"merged":[]}
[]
[null,{"$f":"Race!A5","v":"RADIO TAB"},null,{"$f":"Race!B5","v":"10-5-12-9"},null,{"$f":"Race!C5","v":0},null,{"$f":"Race!D5","v":0},null,{"$f":"Race!E5","v":"Late Mail 10"}]
[]
[null,null,"Venue",{"$f":"Data!N1","v":"Morphettville Pk"},null,null,"Race",{"$f":"Data!O2","v":"3"},"Class",{"$f":"Form!E2","v":"Maiden"},null,"Value",{"$f":"Form!H3","v":10000},"Distance",{"$f":"Form!I2","v":"1400m"},null,"Race Time",null,{"$f":"Form!A3-(U4/24)","v":-0.05},"-",3,"Hours"]
[]
[]
[null,"Form","No","Runner",null,null,"Trainer",null,"Jockey",null,"Weight","Barrier","Rated","Rating",null,"Price"]
[]
[null,{"$f":"IF(C9=\"\",\"\",Form!B5)","v":376},{"$f":"IF(Data!BB2=\"\",\"\",Data!BB2)","v":1},{"$f":"IF(C9=\"\",\"\",IF(VLOOKUP(Data!AZ2,Race!C1:N100,6,FALSE)=\"SCRATCHED\",\"SCRATCHED\",Data!AZ2))","v":"Hoosang"},null,null,{"$f":"IF(C9=\"\",\"\",IF(D9=\"SCRATCHED\",\"\",Form!D5))","v":"J E Hickmott"},null,{"$f":"IF(C9=\"\",\"\",IF(D9=\"SCRATCHED\",\"\",Form!E5))","v":"D Robinson"},null,{"$f":"IF(C9=\"\",\"\",IF(D9=\"SCRATCHED\",\"\",Form!F5))","v":57},{"$f":"IF(C9=\"\",\"\",IF(D9=\"SCRATCHED\",\"\",VLOOKUP(D9,Race!$C$1:'Race'!$N$100,7,FALSE)))","v":6},{"$f":"IF(C9=\"\",\"\",IF(N9=\"\",\"\",IF(RANK(N9,$N$9:$N$32)<5,RANK(N9,$N$9:$N$32),\"\")))","v":{"$error":"#N/A"}},{"$f":"IF(C9=\"\",\"\",IF(D9=\"SCRATCHED\",\"\",Data!EI2))","v":{"$error":"#N/A"}},{"$f":"IF(N9=\"\",\"\",(N9/$N$34)*100)","v":{"$error":"#N/A"}},{"$f":"IF(O9=\"\",\"\",IF(O9=0,50,110/O9))","v":{"$error":"#N/A"}},{"$f":"IF(Race!D2=\"Paying\",\"Paying\",\"\")","v":"Paying"}]
[null,{"$f":"IF(C10=\"\",\"\",Form!B6)","v":8735},{"$f":"IF(Data!BB3=\"\",\"\",Data!BB3)","v":2},{"$f":"IF(C10=\"\",\"\",IF(VLOOKUP(Data!AZ3,Race!C2:N101,6,FALSE)=\"SCRATCHED\",\"SCRATCHED\",Data!AZ3))","v":"Kotor"},null,null,{"$f":"IF(B10=\"\",\"\",IF(D10=\"SCRATCHED\",\"\",Form!D6))","v":"S G Padman"},null,{"$f":"IF(B10=\"\",\"\",IF(D10=\"SCRATCHED\",\"\",Form!E6))","v":"S Cahill"},null,{"$f":"IF(B10=\"\",\"\",IF(D10=\"SCRATCHED\",\"\",Form!F6))","v":57},{"$f":"IF(C10=\"\",\"\",IF(D10=\"SCRATCHED\",\"\",VLOOKUP(D10,Race!$C$1:$N$100,7,FALSE)))","v":16},{"$f":"IF(C10=\"\",\"\",IF(N10=\"\",\"\",IF(RANK(N10,$N$9:$N$32)<5,RANK(N10,$N$9:$N$32),\"\")))","v":{"$error":"#N/A"}},{"$f":"IF(C10=\"\",\"\",IF(D10=\"SCRATCHED\",\"\",Data!EI3))","v":{"$error":"#N/A"}},{"$f":"IF(N10=\"\",\"\",(N10/$N$34)*100)","v":{"$error":"#N/A"}},{"$f":"IF(O10=\"\",\"\",IF(O10=0,50,110/O10))","v":{"$error":"#N/A"}},{"$nulls":4},{"$f":"IF($Q$9<>\"\",\"Win\",\"\")","v":"Win"},{"$f":"IF($Q$9<>\"\",\"Place\",\"\")","v":"Place"}]
[null,{"$f":"IF(C11=\"\",\"\",Form!B7)","v":93753},{"$f":"IF(Data!BB4=\"\",\"\",Data!BB4)","v":3},{"$f":"IF(C11=\"\",\"\",IF(VLOOKUP(Data!AZ4,Race!C3:N102,6,FALSE)=\"SCRATCHED\",\"SCRATCHED\",Data!AZ4))","v":"Red Hot Jeune"},null,null,{"$f":"IF(B11=\"\",\"\",IF(D11=\"SCRATCHED\",\"\",Form!D7))","v":"P L Seater"},null,{"$f":"IF(B11=\"\",\"\",IF(D11=\"SCRATCHED\",\"\",Form!E7))","v":"M Neilson"},null,{"$f":"IF(B11=\"\",\"\",IF(D11=\"SCRATCHED\",\"\",Form!F7))","v":57},{"$f":"IF(C11=\"\",\"\",IF(D11=\"SCRATCHED\",\"\",VLOOKUP(D11,Race!$C$1:$N$100,7,FALSE)))","v":17},{"$f":"IF(C11=\"\",\"\",IF(N11=\"\",\"\",IF(RANK(N11,$N$9:$N$32)<5,RANK(N11,$N$9:$N$32),\"\")))","v":{"$error":"#N/A"}},{"$f":"IF(C11=\"\",\"\",IF(D11=\"SCRATCHED\",\"\",Data!EI4))","v":{"$error":"#N/A"}},{"$f":"IF(N11=\"\",\"\",(N11/$N$34)*100)","v":{"$error":"#N/A"}},{"$f":"IF(O11=\"\",\"\",IF(O11=0,50,110/O11))","v":{"$error":"#N/A"}},{"$f":"IF($Q$9<>\"\",\"1st\",\"\")","v":"1st"},{"$f":"IF($Q$9=\"\",\"\",INDEX(Race!$A$1:$A$20,MATCH(\"QN\",Race!$A1:$A$20,0)-4,0))","v":10},{"$f":"IF($Q$9=\"\",\"\",INDEX(Race!$A$1:$C20,MATCH(\"QN\",Race!$A1:$A$20,0)-4,3))","v":"OFTEN AWAY"},null,{"$f":"IF($Q$9=\"\",\"\",INDEX(Race!$A$1:$E20,MATCH(\"QN\",Race!$A1:$A$20,0)-4,4))","v":4.5},{"$f":"IF($Q$9=\"\",\"\",INDEX(Race!$A$1:$E20,MATCH(\"QN\",Race!$A1:$A$20,0)-4,5))","v":1.8}]
[null,{"$f":"IF(C12=\"\",\"\",Form!B8)","v":855944},{"$f":"IF(Data!BB5=\"\",\"\",Data!BB5)","v":4},{"$f":"IF(C12=\"\",\"\",IF(VLOOKUP(Data!AZ5,Race!C4:N103,6,FALSE)=\"SCRATCHED\",\"SCRATCHED\",Data!AZ5))","v":"Shiraz Knight"},null,null,{"$f":"IF(B12=\"\",\"\",IF(D12=\"SCRATCHED\",\"\",Form!D8))","v":"J Maddigan"},null,{"$f":"IF(B12=\"\",\"\",IF(D12=\"SCRATCHED\",\"\",Form!E8))","v":"B Hoppo"},null,{"$f":"IF(B12=\"\",\"\",IF(D12=\"SCRATCHED\",\"\",Form!F8))","v":57},{"$f":"IF(C12=\"\",\"\",IF(D12=\"SCRATCHED\",\"\",VLOOKUP(D12,Race!$C$1:$N$100,7,FALSE)))","v":1},{"$error":"#N/A"},{"$f":"IF(C12=\"\",\"\",IF(D12=\"SCRATCHED\",\"\",Data!EI5))","v":{"$error":"#N/A"}},{"$error":"#N/A"},{"$error":"#N/A"},{"$f":"IF($Q$9<>\"\",\"2nd\",\"\")","v":"2nd"},{"$f":"IF($Q$9=\"\",\"\",INDEX(Race!$A$1:$A$20,MATCH(\"QN\",Race!$A1:$A$20,0)-3,0))","v":7},{"$f":"IF($Q$9=\"\",\"\",INDEX(Race!$A$1:$C21,MATCH(\"QN\",Race!$A2:$A$20,0)-2,3))","v":"BURGUNDY NOTES"},null,null,{"$f":"IF($Q$9=\"\",\"\",INDEX(Race!$A$1:$E20,MATCH(\"QN\",Race!$A1:$A$20,0)-3,5))","v":12.8}]
[null,{"$f":"IF(C13=\"\",\"\",Form!B9)","v":5423},{"$f":"IF(Data!BB6=\"\",\"\",Data!BB6)","v":5},{"$f":"IF(C13=\"\",\"\",IF(VLOOKUP(Data!AZ6,Race!C5:N104,6,FALSE)=\"SCRATCHED\",\"SCRATCHED\",Data!AZ6))","v":"Drafted"},null,null,{"$f":"IF(B13=\"\",\"\",IF(D13=\"SCRATCHED\",\"\",Form!D9))","v":"M S Minervini"},null,{"$f":"IF(B13=\"\",\"\",IF(D13=\"SCRATCHED\",\"\",Form!E9))","v":"C Lions"},null,{"$f":"IF(B13=\"\",\"\",IF(D13=\"SCRATCHED\",\"\",Form!F9))","v":55.5},{"$f":"IF(C13=\"\",\"\",IF(D13=\"SCRATCHED\",\"\",VLOOKUP(D13,Race!$C$1:$N$100,7,FALSE)))","v":2},{"$error":"#N/A"},{"$f":"IF(C13=\"\",\"\",IF(D13=\"SCRATCHED\",\"\",Data!EI6))","v":{"$error":"#N/A"}},{"$error":"#N/A"},{"$error":"#N/A"},{"$f":"IF($Q$9<>\"\",\"3rd\",\"\")","v":"3rd"},{"$f":"IF($Q$9=\"\",\"\",INDEX(Race!$A$1:$A$20,MATCH(\"QN\",Race!$A1:$A$20,0)-2,0))","v":12},{"$f":"IF($Q$9=\"\",\"\",INDEX(Race!$A$1:$C22,MATCH(\"QN\",Race!$A3:$A$20,0)-0,3))","v":"RED SAVINA"},null,null,{"$f":"IF($Q$9=\"\",\"\",INDEX(Race!$A$1:$E20,MATCH(\"QN\",Race!$A1:$A$20,0)-2,5))","v":1.6}]
[null,{"$f":"IF(C14=\"\",\"\",Form!B10)","v":7},{"$f":"IF(Data!BB7=\"\",\"\",Data!BB7)","v":6},{"$f":"IF(C14=\"\",\"\",IF(VLOOKUP(Data!AZ7,Race!C6:N105,6,FALSE)=\"SCRATCHED\",\"SCRATCHED\",Data!AZ7))","v":"Baena"},null,null,{"$f":"IF(B14=\"\",\"\",IF(D14=\"SCRATCHED\",\"\",Form!D10))","v":"Ms R Day"},null,{"$f":"IF(B14=\"\",\"\",IF(D14=\"SCRATCHED\",\"\",Form!E10))","v":"A Patterson"},null,{"$f":"IF(B14=\"\",\"\",IF(D14=\"SCRATCHED\",\"\",Form!F10))","v":55},{"$f":"IF(C14=\"\",\"\",IF(D14=\"SCRATCHED\",\"\",VLOOKUP(D14,Race!$C$1:$N$100,7,FALSE)))","v":18},{"$error":"#N/A"},{"$f":"IF(C14=\"\",\"\",IF(D14=\"SCRATCHED\",\"\",Data!EI7))","v":{"$error":"#N/A"}},{"$error":"#N/A"},{"$error":"#N/A"}]
[null,{"$f":"IF(C15=\"\",\"\",Form!B11)","v":522227},{"$f":"IF(Data!BB8=\"\",\"\",Data!BB8)","v":7},{"$f":"IF(C15=\"\",\"\",IF(VLOOKUP(Data!AZ8,Race!C7:N106,6,FALSE)=\"SCRATCHED\",\"SCRATCHED\",Data!AZ8))","v":"Burgundy Notes"},null,null,{"$f":"IF(B15=\"\",\"\",IF(D15=\"SCRATCHED\",\"\",Form!D11))","v":"Bill Papazaharoudakis"},null,{"$f":"IF(B15=\"\",\"\",IF(D15=\"SCRATCHED\",\"\",Form!E11))","v":"J Matthews"},null,{"$f":"IF(B15=\"\",\"\",IF(D15=\"SCRATCHED\",\"\",Form!F11))","v":55},{"$f":"IF(C15=\"\",\"\",IF(D15=\"SCRATCHED\",\"\",VLOOKUP(D15,Race!$C$1:$N$100,7,FALSE)))","v":0},{"$error":"#N/A"},{"$f":"IF(C15=\"\",\"\",IF(D15=\"SCRATCHED\",\"\",Data!EI8))","v":{"$error":"#N/A"}},{"$error":"#N/A"},{"$error":"#N/A"},{"$f":"IF($Q$9=\"\",\"\",\"QN\")","v":"QN"},{"$f":"IF($Q$9=\"\",\"\",INDEX(Race!$A$1:$C20,MATCH(\"EX\",Race!$A1:$A$20,0)-1,2))","v":"7*10"},null,null,{"$f":"IF($Q$9=\"\",\"\",INDEX(Race!$A$1:$C20,MATCH(\"EX\",Race!$A1:$A$20,0)-1,3))","v":203}]
[null,{"$f":"IF(C16=\"\",\"\",Form!B12)","v":805244},{"$f":"IF(Data!BB9=\"\",\"\",Data!BB9)","v":8},{"$f":"IF(C16=\"\",\"\",IF(VLOOKUP(Data!AZ9,Race!C8:N107,6,FALSE)=\"SCRATCHED\",\"SCRATCHED\",Data!AZ9))","v":"Champagne Journey"},null,null,{"$f":"IF(B16=\"\",\"\",IF(D16=\"SCRATCHED\",\"\",Form!D12))","v":"Ms E Hubbard"},null,{"$f":"IF(B16=\"\",\"\",IF(D16=\"SCRATCHED\",\"\",Form!E12))","v":"T Baker"},null,{"$f":"IF(B16=\"\",\"\",IF(D16=\"SCRATCHED\",\"\",Form!F12))","v":55},{"$f":"IF(C16=\"\",\"\",IF(D16=\"SCRATCHED\",\"\",VLOOKUP(D16,Race!$C$1:$N$100,7,FALSE)))","v":12},{"$error":"#N/A"},{"$f":"IF(C16=\"\",\"\",IF(D16=\"SCRATCHED\",\"\",Data!EI9))","v":{"$error":"#N/A"}},{"$error":"#N/A"},{"$error":"#N/A"},{"$f":"IF($Q$9=\"\",\"\",\"EX\")","v":"EX"},{"$f":"IF($Q$9=\"\",\"\",INDEX(Race!$A$1:$C21,MATCH(\"QN\",Race!$A2:$A$20,0)+2,2))","v":"10* 7"},null,null,{"$f":"IF($Q$9=\"\",\"\",INDEX(Race!$A$1:$C21,MATCH(\"QN\",Race!$A2:$A$20,0)+2,3))","v":187.1}]
[null,{"$f":"IF(C17=\"\",\"\",Form!B13)","v":354423},{"$f":"IF(Data!BB10=\"\",\"\",Data!BB10)","v":9},{"$f":"IF(C17=\"\",\"\",IF(VLOOKUP(Data!AZ10,Race!C9:N108,6,FALSE)=\"SCRATCHED\",\"SCRATCHED\",Data!AZ10))","v":"Coco Loco"},null,null,{"$f":"IF(B17=\"\",\"\",IF(D17=\"SCRATCHED\",\"\",Form!D13))","v":"L Kennewell"},null,{"$f":"IF(B17=\"\",\"\",IF(D17=\"SCRATCHED\",\"\",Form!E13))","v":"D Tourneur"},null,{"$f":"IF(B17=\"\",\"\",IF(D17=\"SCRATCHED\",\"\",Form!F13))","v":55},{"$f":"IF(C17=\"\",\"\",IF(D17=\"SCRATCHED\",\"\",VLOOKUP(D17,Race!$C$1:$N$100,7,FALSE)))","v":7},{"$error":"#N/A"},{"$f":"IF(C17=\"\",\"\",IF(D17=\"SCRATCHED\",\"\",Data!EI10))","v":{"$error":"#N/A"}},{"$error":"#N/A"},{"$error":"#N/A"},{"$f":"IF($Q$9=\"\",\"\",\"TF\")","v":"TF"},{"$f":"IF($Q$9=\"\",\"\",INDEX(Race!$A$1:$I20,MATCH(\"EX\",Race!$A1:$A$20,0)-1,8))","v":"10* 7*12"},null,null,{"$f":"IF($Q$9=\"\",\"\",INDEX(Race!$A$1:$I20,MATCH(\"EX\",Race!$A1:$A$20,0)-1,9))","v":1171.9000000000001}]
[null,{"$f":"IF(C18=\"\",\"\",Form!B14)","v":334422},{"$f":"IF(Data!BB11=\"\",\"\",Data!BB11)","v":10},{"$f":"IF(C18=\"\",\"\",IF(VLOOKUP(Data!AZ11,Race!C10:N109,6,FALSE)=\"SCRATCHED\",\"SCRATCHED\",Data!AZ11))","v":"Often Away"},null,null,{"$f":"IF(B18=\"\",\"\",IF(D18=\"SCRATCHED\",\"\",Form!D14))","v":"John Thompson"},null,{"$f":"IF(B18=\"\",\"\",IF(D18=\"SCRATCHED\",\"\",Form!E14))","v":"P Gatt"},null,{"$f":"IF(B18=\"\",\"\",IF(D18=\"SCRATCHED\",\"\",Form!F14))","v":55},{"$f":"IF(C18=\"\",\"\",IF(D18=\"SCRATCHED\",\"\",VLOOKUP(D18,Race!$C$1:$N$100,7,FALSE)))","v":0},{"$error":"#N/A"},{"$f":"IF(C18=\"\",\"\",IF(D18=\"SCRATCHED\",\"\",Data!EI11))","v":{"$error":"#N/A"}},{"$error":"#N/A"},{"$error":"#N/A"},{"$f":"IF($Q$9=\"\",\"\",\"F4\")","v":"F4"},{"$f":"IF($Q$9=\"\",\"\",INDEX(Race!$A$1:$C23,MATCH(\"EX\",Race!$A4:$A$20,0)+4,2))","v":"10* 7*12* 3"},null,null,{"$f":"IF($Q$9=\"\",\"\",INDEX(Race!$A$1:$C23,MATCH(\"EX\",Race!$A4:$A$20,0)+4,3))","v":2793.4}]
[null,{"$f":"IF(C19=\"\",\"\",Form!B15)","v":6},{"$f":"IF(Data!BB12=\"\",\"\",Data!BB12)","v":11},{"$f":"IF(C19=\"\",\"\",IF(VLOOKUP(Data!AZ12,Race!C11:N110,6,FALSE)=\"SCRATCHED\",\"SCRATCHED\",Data!AZ12))","v":"Promotional"},null,null,{"$f":"IF(B19=\"\",\"\",IF(D19=\"SCRATCHED\",\"\",Form!D15))","v":"Leon Macdonald & Andrew Gluyas"},null,{"$f":"IF(B19=\"\",\"\",IF(D19=\"SCRATCHED\",\"\",Form!E15))","v":"C Lindop"},null,{"$f":"IF(B19=\"\",\"\",IF(D19=\"SCRATCHED\",\"\",Form!F15))","v":55},{"$f":"IF(C19=\"\",\"\",IF(D19=\"SCRATCHED\",\"\",VLOOKUP(D19,Race!$C$1:$N$100,7,FALSE)))","v":8},{"$error":"#N/A"},{"$f":"IF(C19=\"\",\"\",IF(D19=\"SCRATCHED\",\"\",Data!EI12))","v":{"$error":"#N/A"}},{"$error":"#N/A"},{"$error":"#N/A"}]
[null,{"$f":"IF(C20=\"\",\"\",Form!B16)","v":373226},{"$f":"IF(Data!BB13=\"\",\"\",Data!BB13)","v":12},{"$f":"IF(C20=\"\",\"\",IF(VLOOKUP(Data!AZ13,Race!C12:N111,6,FALSE)=\"SCRATCHED\",\"SCRATCHED\",Data!AZ13))","v":"Red Savina"},null,null,{"$f":"IF(B20=\"\",\"\",IF(D20=\"SCRATCHED\",\"\",Form!D16))","v":"M A Kavanagh"},null,{"$f":"IF(B20=\"\",\"\",IF(D20=\"SCRATCHED\",\"\",Form!E16))","v":"S Price"},null,{"$f":"IF(B20=\"\",\"\",IF(D20=\"SCRATCHED\",\"\",Form!F16))","v":55},{"$f":"IF(C20=\"\",\"\",IF(D20=\"SCRATCHED\",\"\",VLOOKUP(D20,Race!$C$1:$N$100,7,FALSE)))","v":0},{"$error":"#N/A"},{"$f":"IF(C20=\"\",\"\",IF(D20=\"SCRATCHED\",\"\",Data!EI13))","v":{"$error":"#N/A"}},{"$error":"#N/A"},{"$error":"#N/A"}]
[null,{"$f":"IF(C21=\"\",\"\",Form!B17)","v":64},{"$f":"IF(Data!BB14=\"\",\"\",Data!BB14)","v":13},{"$f":"IF(C21=\"\",\"\",IF(VLOOKUP(Data!AZ14,Race!C13:N112,6,FALSE)=\"SCRATCHED\",\"SCRATCHED\",Data!AZ14))","v":"September Rain"},null,null,{"$f":"IF(B21=\"\",\"\",IF(D21=\"SCRATCHED\",\"\",Form!D17))","v":"P C Barns"},null,{"$f":"IF(B21=\"\",\"\",IF(D21=\"SCRATCHED\",\"\",Form!E17))","v":"J Potter"},null,{"$f":"IF(B21=\"\",\"\",IF(D21=\"SCRATCHED\",\"\",Form!F17))","v":53.5},{"$f":"IF(C21=\"\",\"\",IF(D21=\"SCRATCHED\",\"\",VLOOKUP(D21,Race!$C$1:$N$100,7,FALSE)))","v":4},{"$error":"#N/A"},{"$f":"IF(C21=\"\",\"\",IF(D21=\"SCRATCHED\",\"\",Data!EI14))","v":{"$error":"#N/A"}},{"$error":"#N/A"},{"$error":"#N/A"}]
[null,{"$f":"IF(C22=\"\",\"\",Form!B18)","v":2945},{"$f":"IF(Data!BB15=\"\",\"\",Data!BB15)","v":14},{"$f":"IF(C22=\"\",\"\",IF(VLOOKUP(Data!AZ15,Race!C14:N113,6,FALSE)=\"SCRATCHED\",\"SCRATCHED\",Data!AZ15))","v":"Twilight Dancer"},null,null,{"$f":"IF(B22=\"\",\"\",IF(D22=\"SCRATCHED\",\"\",Form!D18))","v":"W A Bogarts"},null,{"$f":"IF(B22=\"\",\"\",IF(D22=\"SCRATCHED\",\"\",Form!E18))","v":"L Hopwood"},null,{"$f":"IF(B22=\"\",\"\",IF(D22=\"SCRATCHED\",\"\",Form!F18))","v":53.5},{"$f":"IF(C22=\"\",\"\",IF(D22=\"SCRATCHED\",\"\",VLOOKUP(D22,Race!$C$1:$N$100,7,FALSE)))","v":10},{"$error":"#N/A"},{"$f":"IF(C22=\"\",\"\",IF(D22=\"SCRATCHED\",\"\",Data!EI15))","v":{"$error":"#N/A"}},{"$error":"#N/A"},{"$error":"#N/A"}]
[null,{"$f":"IF(C23=\"\",\"\",Form!B19)","v":98},{"$f":"IF(Data!BB16=\"\",\"\",Data!BB16)","v":15},{"$f":"IF(C23=\"\",\"\",IF(VLOOKUP(Data!AZ16,Race!C15:N114,6,FALSE)=\"SCRATCHED\",\"SCRATCHED\",Data!AZ16))","v":"SCRATCHED"},null,null,{"$f":"IF(B23=\"\",\"\",IF(D23=\"SCRATCHED\",\"\",Form!D19))","v":""},null,{"$f":"IF(B23=\"\",\"\",IF(D23=\"SCRATCHED\",\"\",Form!E19))","v":""},null,{"$f":"IF(B23=\"\",\"\",IF(D23=\"SCRATCHED\",\"\",Form!F19))","v":""},{"$f":"IF(C23=\"\",\"\",IF(D23=\"SCRATCHED\",\"\",VLOOKUP(D23,Race!$C$1:$N$100,7,FALSE)))","v":""},"",{"$f":"IF(C23=\"\",\"\",IF(D23=\"SCRATCHED\",\"\",Data!EI16))","v":""},"",""]
[null,{"$f":"IF(C24=\"\",\"\",Form!B20)","v":87},{"$f":"IF(Data!BB17=\"\",\"\",Data!BB17)","v":16},{"$f":"IF(C24=\"\",\"\",IF(VLOOKUP(Data!AZ17,Race!C16:N115,6,FALSE)=\"SCRATCHED\",\"SCRATCHED\",Data!AZ17))","v":"SCRATCHED"},null,null,{"$f":"IF(B24=\"\",\"\",IF(D24=\"SCRATCHED\",\"\",Form!D20))","v":""},null,{"$f":"IF(B24=\"\",\"\",IF(D24=\"SCRATCHED\",\"\",Form!E20))","v":""},null,{"$f":"IF(B24=\"\",\"\",IF(D24=\"SCRATCHED\",\"\",Form!F20))","v":""},{"$f":"IF(C24=\"\",\"\",IF(D24=\"SCRATCHED\",\"\",VLOOKUP(D24,Race!$C$1:$N$100,7,FALSE)))","v":""},"",{"$f":"IF(C24=\"\",\"\",IF(D24=\"SCRATCHED\",\"\",Data!EI17))","v":""},"",""]
[null,{"$f":"IF(C25=\"\",\"\",Form!B21)","v":960},{"$f":"IF(Data!BB18=\"\",\"\",Data!BB18)","v":17},{"$f":"IF(C25=\"\",\"\",IF(VLOOKUP(Data!AZ18,Race!C17:N116,6,FALSE)=\"SCRATCHED\",\"SCRATCHED\",Data!AZ18))","v":"SCRATCHED"},null,null,{"$f":"IF(B25=\"\",\"\",IF(D25=\"SCRATCHED\",\"\",Form!D21))","v":""},null,{"$f":"IF(B25=\"\",\"\",IF(D25=\"SCRATCHED\",\"\",Form!E21))","v":""},null,{"$f":"IF(B25=\"\",\"\",IF(D25=\"SCRATCHED\",\"\",Form!F21))","v":""},{"$f":"IF(C25=\"\",\"\",IF(D25=\"SCRATCHED\",\"\",VLOOKUP(D25,Race!$C$1:$N$100,7,FALSE)))","v":""},"",{"$f":"IF(C25=\"\",\"\",IF(D25=\"SCRATCHED\",\"\",Data!EI18))","v":""},"",""]
[null,{"$f":"IF(C26=\"\",\"\",Form!B22)","v":8},{"$f":"IF(Data!BB19=\"\",\"\",Data!BB19)","v":18},{"$f":"IF(C26=\"\",\"\",IF(VLOOKUP(Data!AZ19,Race!C18:N117,6,FALSE)=\"SCRATCHED\",\"SCRATCHED\",Data!AZ19))","v":{"$error":"#N/A"}},null,null,{"$f":"IF(B26=\"\",\"\",IF(D26=\"SCRATCHED\",\"\",Form!D22))","v":{"$error":"#N/A"}},null,{"$f":"IF(B26=\"\",\"\",IF(D26=\"SCRATCHED\",\"\",Form!E22))","v":{"$error":"#N/A"}},null,{"$f":"IF(B26=\"\",\"\",IF(D26=\"SCRATCHED\",\"\",Form!F22))","v":{"$error":"#N/A"}},{"$f":"IF(C26=\"\",\"\",IF(D26=\"SCRATCHED\",\"\",VLOOKUP(D26,Race!$C$1:$N$100,7,FALSE)))","v":{"$error":"#N/A"}},{"$error":"#N/A"},{"$f":"IF(C26=\"\",\"\",IF(D26=\"SCRATCHED\",\"\",Data!EI19))","v":{"$error":"#N/A"}},{"$error":"#N/A"},{"$error":"#N/A"}]
[null,{"$f":"IF(C27=\"\",\"\",Form!B23)","v":909},{"$f":"IF(Data!BB20=\"\",\"\",Data!BB20)","v":18},{"$f":"IF(C27=\"\",\"\",IF(VLOOKUP(Data!AZ20,Race!C19:N118,6,FALSE)=\"SCRATCHED\",\"SCRATCHED\",Data!AZ20))","v":"SCRATCHED"},null,null,{"$f":"IF(B27=\"\",\"\",IF(D27=\"SCRATCHED\",\"\",Form!D23))","v":""},null,{"$f":"IF(B27=\"\",\"\",IF(D27=\"SCRATCHED\",\"\",Form!E23))","v":""},null,{"$f":"IF(B27=\"\",\"\",IF(D27=\"SCRATCHED\",\"\",Form!F23))","v":""},{"$f":"IF(C27=\"\",\"\",IF(D27=\"SCRATCHED\",\"\",VLOOKUP(D27,Race!$C$1:$N$100,7,FALSE)))","v":""},"",{"$f":"IF(C27=\"\",\"\",IF(D27=\"SCRATCHED\",\"\",Data!EI20))","v":""},"",""]
[null,{"$f":"IF(C28=\"\",\"\",Form!B24)","v":""},{"$f":"IF(Data!BB21=\"\",\"\",Data!BB21)","v":""},{"$f":"IF(C28=\"\",\"\",IF(VLOOKUP(Data!AZ21,Race!C20:N119,6,FALSE)=\"SCRATCHED\",\"SCRATCHED\",Data!AZ21))","v":""},null,null,{"$f":"IF(B28=\"\",\"\",IF(D28=\"SCRATCHED\",\"\",Form!D24))","v":""},null,{"$f":"IF(B28=\"\",\"\",IF(D28=\"SCRATCHED\",\"\",Form!E24))","v":""},null,{"$f":"IF(B28=\"\",\"\",IF(D28=\"SCRATCHED\",\"\",Form!F24))","v":""},{"$f":"IF(C28=\"\",\"\",IF(D28=\"SCRATCHED\",\"\",VLOOKUP(D28,Race!$C$1:$N$100,7,FALSE)))","v":""},"",{"$f":"IF(C28=\"\",\"\",IF(D28=\"SCRATCHED\",\"\",Data!EI21))","v":""},"",""]
[null,{"$f":"IF(C29=\"\",\"\",Form!B25)","v":""},{"$f":"IF(Data!BB22=\"\",\"\",Data!BB22)","v":""},{"$f":"IF(C29=\"\",\"\",IF(VLOOKUP(Data!AZ22,Race!C21:N120,6,FALSE)=\"SCRATCHED\",\"SCRATCHED\",Data!AZ22))","v":""},null,null,{"$f":"IF(B29=\"\",\"\",IF(D29=\"SCRATCHED\",\"\",Form!D25))","v":""},null,{"$f":"IF(B29=\"\",\"\",IF(D29=\"SCRATCHED\",\"\",Form!E25))","v":""},null,{"$f":"IF(B29=\"\",\"\",IF(D29=\"SCRATCHED\",\"\",Form!F25))","v":""},{"$f":"IF(C29=\"\",\"\",IF(D29=\"SCRATCHED\",\"\",VLOOKUP(D29,Race!$C$1:$N$100,7,FALSE)))","v":""},"",{"$f":"IF(C29=\"\",\"\",IF(D29=\"SCRATCHED\",\"\",Data!EI22))","v":""},"",""]
[null,{"$f":"IF(C30=\"\",\"\",Form!B26)","v":""},{"$f":"IF(Data!BB23=\"\",\"\",Data!BB23)","v":""},{"$f":"IF(C30=\"\",\"\",IF(VLOOKUP(Data!AZ23,Race!C22:N121,6,FALSE)=\"SCRATCHED\",\"SCRATCHED\",Data!AZ23))","v":""},null,null,{"$f":"IF(B30=\"\",\"\",IF(D30=\"SCRATCHED\",\"\",Form!D26))","v":""},null,{"$f":"IF(B30=\"\",\"\",IF(D30=\"SCRATCHED\",\"\",Form!E26))","v":""},null,{"$f":"IF(B30=\"\",\"\",IF(D30=\"SCRATCHED\",\"\",Form!F26))","v":""},{"$f":"IF(C30=\"\",\"\",IF(D30=\"SCRATCHED\",\"\",VLOOKUP(D30,Race!$C$1:$N$100,7,FALSE)))","v":""},"",{"$f":"IF(C30=\"\",\"\",IF(D30=\"SCRATCHED\",\"\",Data!EI23))","v":""},"",""]
[null,{"$f":"IF(C31=\"\",\"\",Form!B27)","v":""},{"$f":"IF(Data!BB24=\"\",\"\",Data!BB24)","v":""},{"$f":"IF(C31=\"\",\"\",IF(VLOOKUP(Data!AZ24,Race!C23:N122,6,FALSE)=\"SCRATCHED\",\"SCRATCHED\",Data!AZ24))","v":""},null,null,{"$f":"IF(B31=\"\",\"\",IF(D31=\"SCRATCHED\",\"\",Form!D27))","v":""},null,{"$f":"IF(B31=\"\",\"\",IF(D31=\"SCRATCHED\",\"\",Form!E27))","v":""},null,{"$f":"IF(B31=\"\",\"\",IF(D31=\"SCRATCHED\",\"\",Form!F27))","v":""},{"$f":"IF(C31=\"\",\"\",IF(D31=\"SCRATCHED\",\"\",VLOOKUP(D31,Race!$C$1:$N$100,7,FALSE)))","v":""},"",{"$f":"IF(C31=\"\",\"\",IF(D31=\"SCRATCHED\",\"\",Data!EI24))","v":""},"",""]
[null,{"$f":"IF(C32=\"\",\"\",Form!B28)","v":""},{"$f":"IF(Data!BB25=\"\",\"\",Data!BB25)","v":""},{"$f":"IF(C32=\"\",\"\",IF(VLOOKUP(Data!AZ25,Race!C24:N123,6,FALSE)=\"SCRATCHED\",\"SCRATCHED\",Data!AZ25))","v":""},null,null,{"$f":"IF(B32=\"\",\"\",IF(D32=\"SCRATCHED\",\"\",Form!D28))","v":""},null,{"$f":"IF(B32=\"\",\"\",IF(D32=\"SCRATCHED\",\"\",Form!E28))","v":""},null,{"$f":"IF(B32=\"\",\"\",IF(D32=\"SCRATCHED\",\"\",Form!F28))","v":""},{"$f":"IF(C32=\"\",\"\",IF(D32=\"SCRATCHED\",\"\",VLOOKUP(D32,Race!$C$1:$N$100,7,FALSE)))","v":""},"",{"$f":"IF(C32=\"\",\"\",IF(D32=\"SCRATCHED\",\"\",Data!EI25))","v":""},"",""]
[]
[{"$nulls":13},{"$f":"SUM(N9:N33)*0.98","v":{"$error":"#N/A"}}]

{"sheet":"RaceLists","index":2,"n_rows":44,"n_cols":8,"rows_kept":44,"cut":false,"hidden":false,"merged":[[0,0,0,6],[1,0,1,7],[10,0,10,7],[18,0,18,7],[26,0,26,7],[35,0,35,7],[106,0,106,7],[115,0,115,7],[121,0,121,7],[45,0,45,7],[52,0,52,7],[63,0,63,7],[70,0,70,7],[79,0,79,7],[87,0,87,7],[96,0,96,7]]}
["Select Date",{"$nulls":6},"Live Odds By"]
["Bunbury"]
[1,"12:55:00","Active Plumbing Mdn - 1200m","Fields","Form","Xtra Ratings","Consistency"]
[2,"01:35:00","Tradelink Mdn - 1200m","Fields","Form","Xtra Ratings","Consistency"]
[3,"02:15:00","Australind Pre-mix Mdn - 1400m","Fields","Form","Xtra Ratings","Consistency"]
[4,"02:55:00","Solahart South West Hcp - 1400m","Fields","Form","Xtra Ratings","Consistency"]
[5,"03:30:00","Combined Metal Ind. (bm60+) - 1400m","Fields","Form","Xtra Ratings","Consistency"]
[6,"04:05:00","W A Country Builders Hcp (64) - 1675m","Fields","Form","Xtra Ratings","Consistency"]
[7,"04:40:00","Midland Brick Hcp (c1) - 1100m","Fields","Form","Xtra Ratings","Consistency"]
[8,"05:15:00","Kitchen Cabinet Mftg Hcp (68) - 1200m","Fields","Form","Xtra Ratings","Consistency"]
["Doomben"]
[1,"12:58:00","Glenlogan Park Mdn Plate - 1350m","Fields","Form","Xtra Ratings","Consistency"]
[2,"01:33:00","Sita Environmental Mdn Plate - 1350m","Fields","Form","Xtra Ratings","Consistency"]
[3,"02:08:00","Subiaco Mdn Hcp - 1030m","Fields","Form","Xtra Ratings","Consistency"]
[4,"02:47:00","Woolworths Mdn Hcp - 1030m","Fields","Form","Xtra Ratings","Consistency"]
[5,"03:27:00","Brc.Com.Au Hcp (c3) - 1350m","Fields","Form","Xtra Ratings","Consistency"]
[6,"04:07:00","Q H A Hcp (c3) - 1350m","Fields","Form","Xtra Ratings","Consistency"]
[7,"04:47:00","Hardy Brothers Jewellers (c5) - 1200m","Fields","Form","Xtra Ratings","Consistency"]
["Sandown-Lakeside"]
[1,"01:35:00","American Car Parts Hcp (68) - 1400m","Fields","Form","Xtra Ratings","Consistency"]
[2,"02:10:00","Highways R&r Members Day (78) - 2100m","Fields","Form","Xtra Ratings","Consistency"]
[3,"02:45:00","Patricia Halcroft Hcp (82) - 2100m","Fields","Form","Xtra Ratings","Consistency"]
[4,"03:20:00","Bolland Hcp (68) - 1600m","Fields","Form","Xtra Ratings","Consistency"]
[5,"04:00:00","Betfair Hcp (78) - 1400m","Fields","Form","Xtra Ratings","Consistency"]
[6,"04:40:00","Fri After 3 Club At H'ways-78 - 1200m","Fields","Form","Xtra Ratings","Consistency"]
[7,"05:20:00","Ahern's At Highways Hcp (72) - 1200m","Fields","Form","Xtra Ratings","Consistency"]
["Morphettville Pk"]
[1,"12:38:00","Betfair Mdn Plate - 1000m","Fields","Form","Xtra Ratings","Consistency"]
[2,"01:13:00","Sportingbet Mdn Plate - 1000m","Fields","Form","Xtra Ratings","Consistency"]
[3,"01:48:00","Apache Cat Here Saturday Mdn - 1400m","Fields","Form","Xtra Ratings","Consistency"]
[4,"02:23:00","Adelaide Galvanising Hcp (c1) - 1000m","Fields","Form","Xtra Ratings","Consistency"]
[5,"02:58:00","Schweppes Tonic Hcp (68) - 2250m","Fields","Form","Xtra Ratings","Consistency"]
[6,"03:38:00","Panasonic Hcp (62) - 1250m","Fields","Form","Xtra Ratings","Consistency"]
[7,"04:18:00","Allan Scott Park Hcp (71) - 1400m","Fields","Form","Xtra Ratings","Consistency"]
[8,"04:58:00","Windsor Estate Wines Hcp (62) - 1550m","Fields","Form","Xtra Ratings","Consistency"]
["Warwick Farm"]
[1,"01:50:00","Free Entry Today Mdn Plate - 1600m","Fields","Form","Xtra Ratings","Consistency"]
[2,"02:25:00","Start Of Summer 27/11 Mdn Hcp - 1300m","Fields","Form","Xtra Ratings","Consistency"]
[3,"03:00:00","R'wick Betting Auditorium-bm75 - 2400m","Fields","Form","Xtra Ratings","Consistency"]
[4,"03:37:00","Order Your Ajc Xmas Fare Hcp - 1000m","Fields","Form","Xtra Ratings","Consistency"]
[5,"04:17:00","Ajc Corporate Membership-bm70 - 1600m","Fields","Form","Xtra Ratings","Consistency"]
[6,"04:57:00","Ajc Convention Centre (bm70) - 1300m","Fields","Form","Xtra Ratings","Consistency"]
[7,"05:37:00","100 Club-join Now (bm70) - 1400m","Fields","Form","Xtra Ratings","Consistency"]
["END"]

{"sheet":"Meetings","index":3,"n_rows":27,"n_cols":15,"rows_kept":27,"cut":false,"hidden":false,"merged":[[27,0,27,2],[1,0,1,2],[12,0,12,2],[16,0,16,2]]}
[]
["Races",null,null,1,2,3,4,5,6,7,8,9,10,11,12]
[null,"DOOMBEN (BR)","Fields","5,3,7 F4","2,1,4 F4","(2,4),1 F4","3,8,12 F4","4,6,3 F4","2,4,9 F4","8m F4"]
[null,"WARWICK FARM (SR)","Fields","7,5,2 F4","8,7,10 F4","3,1,7 F4","2,6,9 F4","6,2,7 F4","4,10,3 F4","Closed F4"]
[null,"SANDOWN (MR)","Fields","4,2,1 F4","6,5,2 F4","4,6,1 F4","3,4,6 F4","3,11,6 F4","11,7,10 F4","5,14,8 F4"]
[null,"MORPHETTVILLE (AR)","Fields","9,1,5 F4","6,11,1 F4","10,7,12 F4","3,2,10 F4","1,9,5 F4","9,1,3 F4","12,2,11 F4","1,4,5 F4"]
[null,"BUNBURY (PR)","Fields","2,5,11 ","10,5,6 ","13,1,12 ","16m ","51m ","06:05:00","06:40:00","07:15:00"]
[null,"KENILWORTH (AS)","Fields","09:40:00","10:20:00","10:55:00","11:25:00","11:55:00","12:25am "]
[null,"CHEPSTOW (CS)","Fields","11:10:00","11:40:00"]
[null,"LINGFIELD (ES)","Fields","10:00:00","10:30:00","11:00:00","11:30:00","12:05am ","12:40am "]
[null,"HAPPY VALLEY (OS)","Fields","09:15:00","09:45:00","10:15:00","10:50:00","11:20:00","11:50:00","12:20am ","12:55am "]
[null,"TE AROHA (ZS)","Fields","1,3,5 ","3,10,2 ","18,17,13 ","8,6,19 ","2,1,13 ","11,3,4 ","1,13,11 ","4,1,15 ","7,(9,12) ","19,6,1 "]
["Trots",null,null,1,2,3,4,5,6,7,8,9,10,11,12]
[null,"REDCLIFFE (BT)","Fields","5:40 F4","6:10 F4","6:47 F4","7:21 F4","7:50 F4","8:20 F4","8:50 F4","9:20 F4"]
[null,"DUBBO (ST)","Fields","45m ","05:54:00","06:29:00","07:06:00","07:40:00","08:10:00","08:40:00","09:09:00"]
[null,"MILDURA (MT)","Fields","35m ","05:48:00","06:21:00","06:55:00","07:30:00","08:00:00","08:30:00","09:00:00"]
["Greyhounds",null,null,1,2,3,4,5,6,7,8,9,10,11,12]
[null,"ALBION PARK (BG)","Fields","8,7,10 F4","1,2,8 F4","6,10,7 F4","8,2,1 F4","4,3,8 F4","1,4,6 F4","3m F4","23m F4","41m F4","5:45 F4"]
[null,"THE GARDENS (SG)","Fields","06:02:00","06:26:00","06:44:00","07:03:00","07:26:00","07:46:00","08:06:00","08:26:00","08:46:00","09:06:00"]
[null,"THE MEADOWS (MG)","Fields","6,1,4 ","7,5,8 ","1,5,2 ","8,3,1 ","8,2,6 ","2,4,7 ","2,3,5 ","2,6,9 F4","6,3,4 ","4,8,7 ","5,1,9 ","4,8,1 "]
[null,"IPSWICH (QG)","Fields","6:15 F4","6:34 F4","6:52 F4","7:11 F4","7:35 F4","7:55 F4","8:15 F4","8:35 F4","8:55 F4","9:14 F4"]
[null,"NOWRA (NG)","Fields","3,1,4 ","1,2,3 ","6,3,1 ","8,4,7 ","5,3,1 ","7,8,1 ","4,7,5 ","12m ","31m ","56m "]
[null,"SHEPPARTON (VG)","Fields","4,7,3 ","3,2,7 ","7,8,6 ","3,4,6 ","7,9,10 ","6,5,1 ","Interim ","15m ","34m ","50m ","05:53:00","06:09:00"]
[null,"ANGLE PARK (AG)","Fields","1,7,6 F4","5,7,6 F4","2,5,1 F4","8,7,3 F4","3,2,4 F4","1,2,6 F4","5,1,2 F4","8,1,3 F4","1,4,3 F4","8,3,7 F4"]
[null,"CANNINGTON (PG)","Fields","08:39:00","08:57:00","09:12:00","09:30:00","09:52:00","10:10:00","10:27:00","10:42:00","11:07:00","11:27:00","11:47:00","12:02am "]
[null,"BALLARAT (EG)","Fields","05:59:00","06:18:00","06:37:00","07:00:00","07:18:00","07:38:00","07:58:00","08:18:00","08:38:00","08:58:00","09:18:00","09:35:00"]
[null,"HATRICK (ZG)","Fields","2,1,5 ","2,3,4 ","4,5,3 ","5,2,1 ","4,2,1 ","5,4,6 ","2,4,3 ","3,8,1 ","1,3,2 ","3,7,1 ","2,5,9 ","8,3,2 "]

{"sheet":"Form","index":4,"n_rows":246,"n_cols":9,"rows_kept":246,"cut":false,"hidden":false,"merged":[[227,0,227,2],[227,3,227,7],[231,5,231,7],[236,3,236,5],[236,6,236,7],[237,0,237,2],[237,3,237,7],[238,0,238,7],[241,5,241,7],[216,0,216,2],[216,3,216,5],[216,6,216,7],[217,0,217,2],[217,3,217,7],[221,5,221,7],[224,0,224,7],[226,0,226,2],[226,3,226,5],[226,6,226,7],[179,0,179,2],[179,3,179,7],[183,5,183,7],[198,0,198,2],[198,3,198,5],[198,6,198,7],[199,0,199,2],[199,3,199,7],[203,5,203,7],[165,0,165,2],[165,3,165,7],[169,5,169,7],[173,0,173,7],[175,0,175,7],[176,0,176,7],[178,0,178,2],[178,3,178,5],[178,6,178,7],[156,3,156,5],[156,6,156,7],[157,0,157,2],[157,3,157,7],[158,0,158,7],[161,5,161,7],[164,0,164,2],[164,3,164,5],[164,6,164,7],[125,0,125,2],[125,3,125,5],[125,6,125,7],[126,0,126,2],[126,3,126,7],[130,5,130,7],[139,0,139,7],[141,0,141,7],[142,0,142,2],[142,3,142,5],[142,6,142,7],[47,3,47,7],[51,5,51,7],[56,0,56,7],[58,0,58,2],[58,3,58,5],[58,6,58,7],[59,0,59,2],[59,3,59,7],[63,5,63,7],[235,0,235,7],[218,0,218,7],[223,0,223,7],[206,0,206,7],[207,3,207,5],[207,6,207,7],[208,0,208,2],[208,3,208,7],[209,0,209,7],[212,5,212,7],[187,0,187,2],[187,3,187,5],[187,6,187,7],[188,0,188,2],[188,3,188,7],[189,0,189,7],[192,5,192,7],[194,0,194,7],[195,0,195,7],[172,0,172,7],[177,0,177,7],[108,0,108,7],[107,0,107,7],[109,0,109,7],[110,0,110,2],[110,3,110,5],[110,6,110,7],[111,0,111,2],[111,3,111,7],[115,5,115,7],[104,0,104,7],[105,0,105,7],[90,5,90,7],[92,0,92,7],[93,0,93,2],[93,3,93,5],[93,6,93,7],[94,0,94,2],[94,3,94,7],[98,5,98,7],[87,0,87,7],[73,0,73,7],[74,0,74,2],[74,3,74,5],[74,6,74,7],[75,0,75,2],[75,3,75,7],[76,0,76,7],[79,5,79,7],[85,0,85,2],[85,3,85,5],[85,6,85,7],[86,0,86,2],[86,3,86,7],[57,0,57,7],[70,0,70,7],[71,0,71,7],[37,0,37,7],[24,0,24,2],[24,3,24,5],[24,6,24,7],[25,0,25,2],[25,3,25,7],[29,5,29,7],[35,0,35,2],[35,3,35,5],[35,6,35,7],[36,3,36,7],[236,0,236,2],[118,0,118,7],[200,0,200,7],[185,0,185,7],[153,0,153,7],[154,0,154,7],[36,0,36,2],[53,0,53,7],[40,5,40,7],[42,0,42,7],[46,0,46,2],[46,3,46,5],[46,6,46,7],[47,0,47,2],[250,0,250,7],[251,0,251,7],[253,0,253,7],[254,0,254,7],[233,0,233,7],[234,0,234,7],[205,0,205,7],[207,0,207,2],[214,0,214,7],[149,0,149,7],[150,0,150,7],[152,0,152,7],[140,0,140,7],[138,0,138,7],[144,0,144,7],[143,0,143,2],[143,3,143,7],[147,5,147,7],[119,0,119,7],[120,0,120,7],[81,0,81,7],[82,0,82,7],[66,0,66,7],[67,0,67,7],[69,0,69,7],[72,0,72,7],[84,0,84,7],[54,0,54,7],[33,0,33,7],[55,0,55,7],[26,0,26,7],[31,0,31,7],[34,0,34,7],[44,0,44,7],[32,0,32,7],[83,0,83,7],[68,0,68,7],[43,0,43,7],[103,0,103,7],[196,0,196,7],[45,0,45,7],[48,0,48,7],[112,0,112,7],[134,0,134,7],[197,0,197,7],[60,0,60,7],[65,0,65,7],[163,0,163,7],[100,0,100,7],[117,0,117,7],[106,0,106,7],[186,0,186,7],[174,0,174,7],[166,0,166,7],[171,0,171,7],[0,0,0,4],[0,5,0,8],[1,0,1,1],[1,2,1,3],[1,4,1,5],[1,6,1,7],[2,0,2,1],[2,2,2,3],[2,4,2,6],[2,7,2,8],[317,0,317,7],[311,0,311,7],[316,0,316,7],[266,0,266,7],[249,0,249,7],[252,0,252,7],[244,0,244,7],[292,0,292,7],[308,0,308,7],[286,0,286,7],[314,0,314,7],[315,0,315,7],[296,0,296,7],[297,0,297,7],[298,0,298,7],[299,0,299,7],[272,3,272,5],[272,6,272,7],[273,0,273,2],[273,3,273,7],[290,0,290,7],[267,0,267,7],[282,0,282,7],[283,0,283,7],[243,0,243,7],[245,0,245,7],[215,0,215,7],[313,0,313,7],[303,0,303,7],[309,0,309,7],[310,0,310,7],[312,0,312,7],[301,0,301,2],[301,3,301,5],[301,6,301,7],[302,0,302,2],[302,3,302,7],[306,5,306,7],[291,0,291,7],[295,0,295,7],[300,0,300,7],[293,0,293,7],[294,0,294,7],[228,0,228,7],[225,0,225,7],[257,0,257,7],[269,0,269,7],[268,0,268,7],[270,0,270,7],[271,0,271,7],[272,0,272,2],[255,0,255,2],[255,3,255,5],[255,6,255,7],[256,0,256,2],[256,3,256,7],[260,5,260,7],[318,0,318,2],[318,3,318,5],[318,6,318,7],[319,0,319,2],[319,3,319,7],[323,5,323,7],[326,0,326,7],[327,0,327,7],[328,0,328,7],[325,0,325,7],[320,0,320,7],[329,0,329,7],[330,0,330,7],[331,0,331,7],[332,0,332,7],[333,0,333,7],[334,0,334,7],[335,0,335,2],[335,3,335,5],[335,6,335,7],[336,0,336,2],[336,3,336,7],[337,0,337,7],[340,5,341,7],[342,0,342,7],[343,0,343,7],[344,0,344,7],[345,0,345,7],[346,0,346,7],[347,0,347,7],[348,0,348,7],[349,0,349,7],[350,0,350,7],[351,0,351,7],[352,0,352,2],[352,3,352,5],[352,6,352,7],[353,0,353,2],[353,3,353,7],[354,0,354,7],[357,5,358,7],[359,0,359,7],[360,0,360,7],[361,0,361,7],[362,0,362,7],[363,0,363,7],[364,0,364,7],[365,0,365,7],[366,0,366,7],[367,0,367,7],[368,0,368,7],[369,0,369,2],[369,3,369,5],[369,6,369,7],[370,0,370,2],[370,3,370,7],[371,0,371,7],[393,0,393,7],[394,0,394,7],[395,0,395,7],[396,0,396,7],[397,0,397,7],[398,0,398,7],[399,0,399,7],[374,5,375,7],[376,0,376,7],[377,0,377,7],[378,0,378,7],[379,0,379,7],[380,0,380,7],[381,0,381,7],[382,0,382,7],[383,0,383,7],[384,0,384,7],[385,0,385,7],[386,0,386,2],[386,3,386,5],[386,6,386,7],[387,0,387,2],[387,3,387,7],[388,0,388,7],[391,5,392,7],[402,0,402,2],[402,3,402,7],[403,0,403,7],[406,5,407,7],[408,0,408,7],[400,0,400,7],[401,0,401,2],[401,3,401,5],[401,6,401,7],[432,0,432,7],[428,0,428,7],[429,0,429,7],[430,0,430,7],[431,0,431,7],[409,0,409,7],[410,0,410,7],[411,0,411,7],[412,0,412,7],[423,5,424,7],[425,0,425,7],[426,0,426,7],[427,0,427,7],[420,0,420,7],[413,0,413,7],[414,0,414,7],[415,0,415,7],[416,0,416,7],[417,0,417,7],[418,0,418,2],[418,3,418,5],[418,6,418,7],[419,0,419,2],[419,3,419,7],[280,0,280,7],[281,0,281,7],[246,0,246,7],[247,0,247,7],[248,0,248,7],[277,5,277,7],[262,0,262,7],[263,0,263,7],[264,0,264,7],[265,0,265,7],[284,0,284,7],[285,0,285,7],[287,0,287,7],[288,0,288,7],[289,0,289,7],[279,0,279,7],[274,0,274,7],[95,0,95,7],[102,0,102,7],[101,0,101,7],[123,0,123,7],[136,0,136,7],[137,0,137,7],[132,0,132,7],[133,0,133,7],[135,0,135,7],[121,0,121,7],[127,0,127,7],[122,0,122,7],[124,0,124,7],[180,0,180,7],[151,0,151,7],[156,0,156,2],[155,0,155,7]]}
["Form - Morphettville Pk 24/11/10"]
["Race 3",null,"Apache Cat Here Saturday Mdn",null,"Maiden",null,"3yo+",null,"1400m"]
["01:48:00",null,"Apprentices Can Claim",null,"Set Weight",null,null,10000]
["#","Form","Horse (Barrier)","Trainer","Jockey","Weight","API","Win %","Place %"]
[1,376,"Hoosang (6)","J E Hickmott","D Robinson",57,0.3,0,25]
[2,8735,"Kotor (16)","S G Padman","S Cahill",57,0.2,0,25]
[3,93753,"Red Hot Jeune (17)","P L Seater","M Neilson",57,0.4,0,40]
[4,855944,"Shiraz Knight (1)","J Maddigan","B Hoppo",57,0.1,0,0]
[5,5423,"Drafted (2)","M S Minervini","C Lions",55.5,1.1000000000000001,0,50]
[6,7,"Baena (18)","Ms R Day","A Patterson",55,0,0,0]
[7,522227,"Burgundy Notes (14)","Bill Papazaharoudakis","J Matthews",55,0.7,0,50]
["1900-01-08","4104-09-05","Champagne Journey (12)","Ms E Hubbard","T Baker",55,0.5,0,12.5]
[9,354423,"Coco Loco (7)","L Kennewell","D Tourneur",55,0.7,0,29.4]
[10,334422,"Often Away (9)","John Thompson","P Gatt",55,1.1000000000000001,0,57.1]
[11,6,"Promotional (8)","Leon Macdonald & Andrew Gluyas","C Lindop",55,0,0,0]
[12,373226,"Red Savina (11)","M A Kavanagh","S Price",55,1.2,0,57.1]
[13,64,"September Rain (4)","P C Barns","J Potter",53.5,0.3,0,0]
[14,2945,"Twilight Dancer (10)","W A Bogarts","L Hopwood",53.5,1.1000000000000001,0,25]
["1900-01-15","1900-04-07","Boolcunda Gold (3)","B Dunn","J Frew","1900-02-24T12:00:00","00:00:00","00:00:00",0]
["1900-01-16","1900-03-27","Steely Resolve (5)","Jon O'Connor","T Pannell","1900-02-26","04:48:00","00:00:00",0]
["1900-01-17","1902-08-17","Mr Diligent (15)","W J Smart","T Pannell","1900-02-24T12:00:00","02:24:00","00:00:00",0]
["1900-01-18","1900-01-08","Deed Of Honor (6)","K J Matson","J Frew","1900-02-26","02:24:00","00:00:00",0]
["1900-01-18","1902-06-27","Pack Saddle (13)","G V Richards","M Hoppo","1900-02-26","00:00:00","00:00:00",0]
[]
["1 Hoosang (6) 57.0kg 4yo br g",null,null,"Trainer: J E Hickmott at Murray Bridge",null,null,"Jockey: D Robinson"]
["Colours: Royal blue, cream diagonal stripes and purple cap",null,null,"Breeding: Danasinga - Special Teams by Entrepreneur"]
["Owners: J E Hickmott, K J Hickmott, D King, G H Curtis, M R Mulligan, G J King, J A Coe, J N Pearce, B J Beecroft & T J Macleod"]
["Career:","Earnings:","Win: 0.0%","API:","First Up:","Second Up:","Distance:","Track:"]
["4:0-0-1",1350,"Place: 25.0%","07:12:00","3:0-0-1","1:0-0-0","0:0-0-0","0:0-0-0"]
["Fast:","Good:","Dead:","Slow:","Heavy:"]
["0:0-0-0","4:0-0-1","0:0-0-0","0:0-0-0","0:0-0-0"]
["6-13 6.1L, M.Brge, 2010-11-10, 1200m, Good, Race 1, 4yo+ Mdn, Mdn 4+, $10000, ($0), D Robinson, 13, Cd 57.0-0.0, (SW), 1:12.23, (35.60), 25/1, Settled-9 1200-- 800-- Turn-7, 1-Ambitious Bride 55.0"]
["7-10 9.5L, F. Bay, 2010-07-28, 1100m, Good, Race 3, Mdn, Mdn, $15200, ($0), S Scriven, 5, Cd 58.0-0.0, (SW), 1:03.78, (34.74), 4/1, Settled-- 1200-- 800-- Turn--, 1-Charge Up 58.0"]
["3-12 1.6L, F. Bay, 2010-07-14, 1200m, Good, Race 1, Mdn Plate, Mdn, $15200, ($1300), C Spry, 1, Cd 58.0-0.0, (SW), 1:10.80, (36.10), 12/1, Settled-- 1200-- 800-- Turn--, 1-Sharvee 58.0"]
["12-13 15.6L, Balakl, 2010-02-28, 1400m, Good, Race 5, 3yo+ Mdn, Mdn 3+, $10000, ($0), M Tyndall, 6, Cd 53.0--3.0, (SW), 1:23.64, (), 50/1, Settled-3 1200-- 800-3 Turn-6, 1-Bunker Boy 56.0"]
["2 Kotor (16) 57.0kg 4yo b g",null,null,"Trainer: S G Padman at Murray Bridge",null,null,"Jockey: S Cahill"]
["Colours: Burgundy, gold stripe, black braces, white sleeves, burgundy cuffs, black cap",null,null,"Breeding: Dash For Cash - Lady Milina by Euclase"]
["Owners: P & Mrs J Zecevich"]
["Career:","Earnings:","Win: 0.0%","API:","First Up:","Second Up:","Distance:","Track:"]
["4:0-0-1",900,"Place: 25.0%","04:48:00","2:0-0-0","1:0-0-1","1:0-0-0","1:0-0-0"]
["Fast:","Good:","Dead:","Slow:","Heavy:"]
["0:0-0-0","3:0-0-1","1:0-0-0","0:0-0-0","0:0-0-0"]
["5-13 2.4L, MorhPk, 2010-11-04, 1400m, Good, Race 5, 4yo+ Mdn, Mdn 4+, $10000, ($0), S Cahill, 12, Cd 57.0-0.0, (SW), 1:26.26, (36.74), 9/1, Settled-7 1200-- 800-- Turn-2, 1-Master Beckett 55.0"]
["3-13 2.6L, Strath, 2010-10-20, 1200m, Good, Race 5, 3yo+ Mdn, Mdn 3+, $10000, ($900), S Cahill, 4, Cd 57.0-0.0, (SW), 1:14.24, (36.26), 11/1, Settled-2 1200-- 800-- Turn-2, 1-Chilli Deva 55.0"]
["7-8 5.8L, Balakl, 2010-09-29, 1050m, Dead, Race 3, 4yo+ Mdn, Mdn 4+, $10000, ($0), S Cahill, 1, Cd 57.0-0.0, (SW), 1:02.14, (34.21), 6/1, Settled-4 1200-- 800-- Turn-4, 1-Hollywood Dream 55.0"]
["8-9 5.5L, M.Brge, 2010-03-03, 1000m, Good, Race 2, 3yo Mdn, Mdn 3, $10000, ($0), P Gatt, 2, Cd 56.5-0.0, (SW), 0:58.54, (), 7/1, Settled-4 1200-- 800-- Turn-5, 1-Hearts 'n' Halos 54.5"]
["3 Red Hot Jeune (17) 57.0kg 4yo ch g",null,null,"Trainer: P L Seater at Murray Bridge",null,null,"Jockey: M Neilson"]
["Colours: Royal blue, pink striped sleeves, royal blue cap",null,null,"Breeding: Jeune (GB) - Scarlet Bisque by Biscay"]
["Owners: G L Martin"]
["Career:","Earnings:","Win: 0.0%","API:","First Up:","Second Up:","Distance:","Track:"]
["5:0-0-2",2050,"Place: 40.0%","09:36:00","2:0-0-0","2:0-0-2","0:0-0-0","0:0-0-0"]
["Fast:","Good:","Dead:","Slow:","Heavy:"]
["0:0-0-0","3:0-0-1","2:0-0-1","0:0-0-0","0:0-0-0"]
["3-13 0.6L, M.Brge, 2010-11-10, 1200m, Good, Race 1, 4yo+ Mdn, Mdn 4+, $10000, ($900), M Neilson, 7, Cd 57.0-0.0, (SW), 1:12.23, (35.60), 45/10, Settled-5 1200-- 800-- Turn-4, 1-Ambitious Bride 55.0"]
["5-12 2.8L, Gawlr, 2010-10-27, 1100m, Good, Race 1, 3yo+ Mdn, Mdn 3+, $10000, ($0), M Neilson, 5, Cd 57.0-0.0, (SW), 1:04.93, (34.71), 15/2, Settled-6 1200-- 800-- Turn-6, 1-Cattyshack 52.0"]
["7-12 4.3L, Balakl, 2010-06-09, 1055m, Dead, Race 3, 3yo+ Mdn, Mdn 3+, $10000, ($0), S Price, 7, Cd 56.5-0.0, (SW), 1:03.40, (36.10), 32/10, Settled-7 1200-- 800-- Turn-6, 1-Red England 57.0"]
["3-11 3.0L, M.Brge, 2010-05-26, 1006m, Dead, Race 4, 3yo+ Mdn, Mdn 3+, $10000, ($900), S Price, 1, Cd 56.5-0.0, (SW), 0:59.55, (35.47), 5/1, Settled-1 1200-- 800-- Turn-1, 1-Silent Mode 54.5"]
["9-11 3.9L, Bend, 2010-05-07, 1000m, Good, Race 1, 3yo Mdn, Mdn 3, $13000, ($200), M Pumpa, 6, Cd 57.0-0.0, (SW), 0:58.68, (), 9/1, Settled-1 1200-- 800-- Turn-1, 1-Bel Shandy 57.0"]
["4 Shiraz Knight (1) 57.0kg 6yo b/br g",null,null,"Trainer: J Maddigan at Morphettville",null,null,"Jockey: B Hoppo"]
["Colours: Gold, royal blue spots, green hooped sleeves and cap",null,null,"Breeding: Staaraq - Lady Jennifer by Hamersley"]
["Owners: J L P Maddigan, J L Maddigan, Mrs K S Maddigan, P G Hansen & A J Whiley"]
["Career:","Earnings:","Win: 0.0%","API:","First Up:","Second Up:","Distance:","Track:"]
["9:0-0-0",1200,"Place: 0.0%","02:24:00","3:0-0-0","2:0-0-0","0:0-0-0","1:0-0-0"]
["Fast:","Good:","Dead:","Slow:","Heavy:"]
["0:0-0-0","4:0-0-0","2:0-0-0","3:0-0-0","0:0-0-0"]
["4-12 4.5L, Gawlr, 2010-09-12, 2100m, Slow, Race 2, 3yo+ Mdn, Mdn 3+, $10000, ($600), O Ay, 5, Cd 54.0--3.0, (SW), 2:16.97, (39.00), 55/10, Settled-11 1200-12 800-12 Turn-10, 1-Marizza's Dream 53.5"]
["4-10 2.1L, Gawlr, 2010-08-05, 2100m, Slow, Race 4, 3yo+ Mdn, Mdn 3+, $10000, ($600), D Robinson, 3, Cd 57.0-0.0, (SW), 2:19.12, (39.15), 20/1, Settled-10 1200-10 800-9 Turn-7, 1-Blanche Port 55.0"]
["9-10 5.8L, Strath, 2010-07-21, 2050m, Slow, Race 2, 3yo+ Mdn, Mdn 3+, $10000, ($0), D Robinson, 1, Cd 57.0-0.0, (SW), 2:15.77, (38.97), 8/1, Settled-7 1200-8 800-8 Turn-9, 1-Robeson 56.5"]
["5-12 2.6L, MorhPk, 2010-07-07, 1950m, Dead, Race 4, 2yo+ Mdn, Mdn, $10000, ($0), D Robinson, 3, Cd 57.0-0.0, (SW), 2:06.38, (37.51), 14/1, Settled-10 1200-10 800-8 Turn-10, 1-Big Love 54.5"]
["5-7 4.0L, M.Brge, 2010-06-14, 1400m, Dead, Race 2, 2yo+ Mdn, Mdn, $10000, ($0), D Robinson, 4, Cd 57.0-0.0, (SW), 1:27.05, (), 25/1, Settled-6 1200-- 800-6 Turn-7, 1-Fantastic Glen 54.5"]
["8-13 6.6L, Clare, 2010-03-14, 1800m, Good, Race 2, 3yo+ Mdn, Mdn 3+, $8000, ($0), D Robinson, 5, Cd 57.0-0.0, (SW), 1:55.96, (), 40/1, Settled-- 1200-- 800-- Turn--, 1-Lord Of The Song 57.0"]
["10-13 7.3L, Balakl, 2010-02-28, 1400m, Good, Race 5, 3yo+ Mdn, Mdn 3+, $10000, ($0), O Ay, 3, Cd 54.0--3.0, (SW), 1:23.64, (), 50/1, Settled-11 1200-- 800-12 Turn-10, 1-Bunker Boy 56.0"]
["10-10 7.1L, Strath, 2010-01-27, 1350m, Good, Race 2, 4yo+ Mdn, Mdn 4+, $7700, ($0), S Price, 4, Cd 57.0-0.0, (SW), 1:22.97, (), 20/1, Settled-10 1200-- 800-- Turn-10, 1-Alakate 55.0"]
["15-16 26.7L, Mphvl, 2009-08-19, 1050m, Good, Race 3, 3yo+ Mdn, Mdn 3+, $7700, ($0), M Hoppo, 12, Cd 57.0-0.0, (SW), 0:59.42, (33.86), 40/1, Settled-14 1200-- 800-- Turn-15, 1-Definitely Ready 55.0"]
["5 Drafted (2) 55.5kg 3yo br g",null,null,"Trainer: M S Minervini at Morphettville",null,null,"Jockey: C Lions"]
["Colours: White, red and black diamond sash and armbands",null,null,"Breeding: Commands - Diplome by End Sweep"]
["Owners: J I Halsall, P J & Mrs E B Noone, D P & D A Heffernan, Diplomats & M A Nunan"]
["Career:","Earnings:","Win: 0.0%","API:","First Up:","Second Up:","Distance:","Track:"]
["2010-01-01T04:00:00",4200,"Place: 50.0%","1900-01-01T02:24:00","2:0-1-0","2:0-0-1","0:0-0-0","0:0-0-0"]
["Fast:","Good:","Dead:","Slow:","Heavy:"]
["0:0-0-0","2010-01-01T02:00:00","2:0-0-0","0:0-0-0","0:0-0-0"]
["3-12 1.3L, Gawlr, 2010-11-17, 1100m, Good, Race 2, 3yo+ E&g Mdn, Mdn 3+, $10000, ($900), S Cahill, 3, Cd 55.5-0.0, (SW), 1:04.90, (35.38), 15/10F, Settled-- 1200-- 800-- Turn--, 1-Vintage Punch 55.5"]
["2-13 0.8L, Mphvl, 2010-11-02, 1200m, Good, Race 2, 3yo+ E&g Mdn, Mdn 3+, $10000, ($1800), S Cahill, 8, Cd 55.5-0.0, (SW), 1:10.73, (35.62), 22/10, Settled-3 1200-- 800-- Turn-5, 1-Mavross 57.0"]
["4-11 3.5L, Balakl, 2010-06-09, 1210m, Dead, Race 1, 2yo Mdn, Mdn 2, $10000, ($600), S Cahill, 6, Cd 56.5-0.0, (SW), 1:12.89, (), 11/10F, Settled-5 1200-- 800-- Turn-5, 1-Kosciuszko's Side 56.5"]
["5-12 4.4L, Mphvl, 2010-05-29, 1000m, Dead, Race 1, 2yo Hcp, Open 2, $40000, ($900), A Patterson, 12, Cd 55.5-0.0, (53.0), 1:00.18, (36.35), 6/1, Settled-5 1200-- 800-- Turn-6, 1-Lilgiggleo 54.5"]
["6 Baena (18) 55.0kg 4yo b m",null,null,"Trainer: Ms R Day at Strathalbyn",null,null,"Jockey: A Patterson"]
["Colours: Green, white hooped sleeves",null,null,"Breeding: Akhadan - Tally Belle by Canny Lad"]
["Owners: Dr H Awang, C Tan, W H Lee, Dr Y Awang & Dato Azzat Kamaludin"]
["Career:","Earnings:","Win: 0.0%","API:","First Up:","Second Up:","Distance:","Track:"]
["1:0-0-0",0,"Place: 0.0%","00:00:00","1:0-0-0","0:0-0-0","0:0-0-0","1:0-0-0"]
["Fast:","Good:","Dead:","Slow:","Heavy:"]
["0:0-0-0","1:0-0-0","0:0-0-0","0:0-0-0","0:0-0-0"]
["7-10 4.7L, MorhPk, 2010-11-04, 1250m, Good, Race 1, 3yo+ F&m Mdn, Mdn fm, $10000, ($0), J Frew, 1, Cd 53.5--3.0, (SW), 1:15.57, (36.01), 60/1, Settled-3 1200-- 800-- Turn-7, 1-Fleet Riane 55.0"]
["7 Burgundy Notes (14) 55.0kg 5yo b m",null,null,"Trainer: Bill Papazaharoudakis at Morphettville",null,null,"Jockey: J Matthews"]
["Colours: Light green, dark green, light green sleeves with dark green horse stripe,",null,null,"Breeding: Montjeu (IRE) - Tosca (ARG) by Laramie Trail"]
["Owners: Tosca Farm Syndicate & Ms H Papazaharoudakis"]
["Career:","Earnings:","Win: 0.0%","API:","First Up:","Second Up:","Distance:","Track:"]
["10:0-5-0",7350,"Place: 50.0%",0.7,"3:0-1-0","1:0-0-0","2:0-0-0","1:0-1-0"]
["Fast:","Good:","Dead:","Slow:","Heavy:"]
["0:0-0-0","10:0-5-0","0:0-0-0","0:0-0-0","0:0-0-0"]
["7-13 6.2L, M.Brge, 2010-11-10, 1200m, Good, Race 1, 4yo+ Mdn, Mdn 4+, $10000, ($0), T Pannell, 5, Cd 55.0-0.0, (SW), 1:12.23, (35.60), 4/1, Settled-4 1200-- 800-- Turn-5, 1-Ambitious Bride 55.0"]
["2-6 3.0L, Balakl, 2010-02-28, 2200m, Good, Race 1, 3yo+ Mdn, Mdn 3+, $10000, ($1800), C Lever, 1, Cd 55.0-0.0, (SW), 2:23.96, (), 8/11F, Settled-1 1200-1 800-1 Turn-3, 1-Pleats 55.0"]
["2-10 2.3L, Mphvl, 2010-02-03, 2028m, Good, Race 2, 3yo+ Mdn, Mdn 3+, $10000, ($1800), M Neilson, 6, Cd 55.0-0.0, (SW), 2:06.17, (36.49), 2/1F, Settled-4 1200-4 800-4 Turn-5, 1-Autentico Teatro 57.0"]
["2-7 0.4L, Mphvl, 2010-01-20, 2044m, Good, Race 4, 3yo+ Mdn, Mdn 3+, $7700, ($1000), M Neilson, 6, Cd 55.0-0.0, (SW), 2:09.76, (37.43), 15/10F, Settled-5 1200-5 800-4 Turn-3, 1-Hold That Conquest 53.5"]
["2-9 4.0L, Mphvl, 2010-01-06, 1600m, Good, Race 3, 3yo+ Mdn, Mdn 3+, $7700, ($1300), M Neilson, 8, Cd 55.0-0.0, (SW), 1:37.47, (36.35), 4/1, Settled-7 1200-7 800-7 Turn-5, 1-Syanna's Bro 57.0"]
["5-14 5.6L, Mphvl, 2009-12-23, 1200m, Good, Race 4, 3yo+ Mdn, Mdn 3+, $7700, ($0), M Neilson, 4, Cd 55.0-0.0, (SW), 1:10.68, (35.42), 12/1, Settled-11 1200-- 800-- Turn-6, 1-Catsonsong 55.5"]
["9-11 5.1L, Balakl, 2009-11-25, 1407m, Good, Race 8, 3yo+ Mdn, Mdn 3+, $7700, ($0), C Lever, 1, Cd 55.0-0.0, (SW), 1:24.30, (), 22/10, Settled-4 1200-- 800-5 Turn-6, 1-Sacre Nazaire 57.0"]
["5-11 3.5L, M.Brge, 2009-11-18, 1400m, Good, Race 8, 3yo+ Mdn, Mdn 3+, $7700, ($0), C Lever, 7, Cd 55.0-0.0, (SW), 1:24.33, (), 25/10, Settled-9 1200-- 800-10 Turn-10, 1-Ucetek 55.0"]
["2-12 1.0L, MorhPk, 2009-11-05, 1250m, Good, Race 8, 3yo+ F&m Mdn, Mdn fm, $7700, ($1300), C Lever, 10, Cd 56.5-0.0, (SW), 1:16.53, (), 12/1, Settled-8 1200-- 800-- Turn-9, 1-Zhen Zhen 55.0"]
["11-13 9.4L, Balakl, 2009-05-20, 1200m, Good, Race 3, 3yo+ Mdn, Mdn 3+, $7500, ($0), T Baker, 8, Cd 54.5-0.0, (SW), 1:11.64, (), 25/1, Settled-10 1200-- 800-- Turn-11, 1-Cybercyn 52.0"]
["8 Champagne Journey (12) 55.0kg 4yo ch m",null,null,"Trainer: Ms E Hubbard at Strathalbyn",null,null,"Jockey: T Baker"]
["Colours: Light blue and purple diamonds, light blue cap, purple pom pom",null,null,"Breeding: Good Journey (USA) - Pamela's Hill by Danehill"]
["Owners: Miss E Hubbard, A N Barratt, C Robertson & Ms M Freeman"]
["Career:","Earnings:","Win: 0.0%","API:","First Up:","Second Up:","Distance:","Track:"]
["8:0-1-0",3600,"Place: 12.5%","12:00:00","1:0-0-0","1:0-0-0","0:0-0-0","0:0-0-0"]
["Fast:","Good:","Dead:","Slow:","Heavy:"]
["0:0-0-0","2:0-0-0","4:0-0-0","1:0-1-0","1:0-0-0"]
["4-13 2.9L, M.Brge, 2010-11-10, 1200m, Good, Race 1, 4yo+ Mdn, Mdn 4+, $10000, ($600), T Baker, 10, Cd 55.0-0.0, (SW), 1:12.23, (35.60), 12/1, Settled-3 1200-- 800-- Turn-2, 1-Ambitious Bride 55.0"]
["4-12 0.6L, Bortwn, 2010-10-24, 1100m, Good, Race 3, 3yo+ Mdn, Mdn 3+, $8000, ($400), T Baker, 7, Cd 55.0-0.0, (SW), 1:06.06, (), 6/1, Settled-- 1200-- 800-- Turn--, 1-Billy Whitesox 57.0"]
["2-15 1.5L, Strath, 2010-09-02, 1250m, Slow, Race 5, 3yo+ Mdn, Mdn 3+, $10000, ($1800), T Baker, 5, Cd 55.0-0.0, (SW), 1:20.90, (39.58), 12/1, Settled-1 1200-- 800-- Turn-1, 1-Any Minute Now 57.0"]
["5-12 6.0L, M.Brge, 2010-07-28, 1000m, Dead, Race 4, 3yo+ Mdn, Mdn 3+, $10000, ($0), T Baker, 3, Cd 54.5-0.0, (SW), 0:59.04, (35.12), 50/1, Settled-7 1200-- 800-- Turn-9, 1-Chicago Hood 56.5"]
["11-12 10.4L, Seymor, 2010-05-24, 1600m, Dead, Race 2, 2yo+ F&m Mdn, Mdn fm, $12000, ($0), L Beer, 1, Cd 57.0-0.0, (SW), 1:39.65, (), 50/1, Settled-3 1200-- 800-3 Turn-3, 1-Bravelli 57.0"]
["8-12 12.7L, P'ham, 2010-05-08, 1300m, Heavy, Race 1, 3yo Mdn, Mdn 3, $12000, ($200), A Mccabe, 5, Cd 54.0--1.0, (SW), 1:21.70, (), 14/1, Settled-8 1200-- 800-- Turn-8, 1-Nenagh 55.0"]
["7-8 7.3L, G'long, 2010-04-09, 1112m, Dead, Race 1, 2yo+ Mdn Plate, Mdn, $13000, ($200), L Currie, 8, Cd 55.5-0.0, (SW), 1:06.33, (38.86), 20/1, Settled-7 1200-- 800-- Turn-8, 1-Brombed Out 56.0"]
["6-8 6.1L, G'long, 2010-03-26, 1103m, Dead, Race 2, 3yo F Mdn, Mdn 3 f, $12000, ($200), Michelle Payne, 2, Cd 57.0-0.0, (SW), 1:05.74, (34.21), 9/1, Settled-5 1200-- 800-- Turn-5, 1-Nothin Mist 57.0"]
["9 Coco Loco (7) 55.0kg 5yo b m",null,null,"Trainer: L Kennewell at Morphettville",null,null,"Jockey: D Tourneur"]
["Colours: Green, black and white checked sash, armbands and cap",null,null,"Breeding: Fusaichi Pegasus (USA) - Really Wild (USA) by Wild Again"]
["Owners: W P & Mrs E S Benson"]
["Career:","Earnings:","Win: 0.0%","API:","First Up:","Second Up:","Distance:","Track:"]
["2010-04-01T17:00:00",12700,"Place: 29.4%",0.7,"3:0-0-1","3:0-0-1","2010-02-01T05:00:00","0:0-0-0"]
["Fast:","Good:","Dead:","Slow:","Heavy:"]
["0:0-0-0","2010-02-01T11:00:00","4:0-0-1","0:0-0-0","2:0-0-1"]
["3-8 4.6L, Kem.Gr, 2010-07-31, 1600m, Heavy, Race 3, Mdn, Mdn, $14000, ($1400), J Penza, 7, Cd 56.5-0.0, (56.0), 1:45.36, (37.68), 5/1, Settled-6 1200-- 800-6 Turn-2, 1-Irish Love 57.5"]
["2-14 0.2L, Kem.Gr, 2010-07-17, 1400m, Good, Race 4, F&m Mdn, Mdn fm, $14000, ($2800), C Reith, 6, Cd 55.5-0.0, (55.5), 1:26.25, (36.30), 7/2, Settled-9 1200-- 800-8 Turn-6, 1-Symphony 55.5"]
["4-14 3.5L, Kem.Gr, 2010-07-03, 1300m, Dead, Race 7, Mdn Plate, Mdn, $14000, ($700), C Reith, 14, Cd 56.0-0.0, (SW), 1:19.78, (34.98), 11/1, Settled-14 1200-- 800-- Turn-13, 1-Patricks 58.0"]
["4-13 1.3L, Kem.Gr, 2010-06-19, 1400m, Dead, Race 7, Mdn Plate, Mdn, $14000, ($700), J Penza, 2, Cd 56.0-0.0, (SW), 1:26.21, (35.61), 9/2, Settled-5 1200-- 800-6 Turn-6, 1-Stratocruiser 58.0"]
["5-6 5.3L, Kem.Gr, 2010-05-29, 1500m, Heavy, Race 7, Mdn Plate, Mdn, $14000, ($0), J Penza, 3, Cd 56.0-0.0, (SW), 1:33.90, (36.56), 9/4, Settled-6 1200-- 800-4 Turn-4, 1-Distant And Lovely 54.5"]
["3-8 0.9L, Kem.Gr, 2010-05-15, 1400m, Good, Race 1, Mdn Plate, Mdn, $14000, ($1400), J Penza, 4, Cd 56.0-0.0, (SW), 1:25.17, (33.41), 4/1, Settled-4 1200-- 800-4 Turn-2, 1-Zoot Suit 58.0"]
["3-11 2.3L, N'ctle, 2010-05-01, 1200m, Dead, Race 5, F&m Mdn, Mdn fm, $14000, ($1400), C Reith, 7, Cd 55.0-0.0, (55.0), 1:11.32, (35.67), 11/1, Settled-11 1200-- 800-- Turn-8, 1-Tokyo Light 55.5"]
["5-12 2.7L, N'ctle, 2009-12-26, 1850m, Dead, Race 6, Mdn, Mdn, $14000, ($0), J Adams, 8, Cd 52.5--2.0, (54.5), 1:54.63, (36.10), 8/1, Settled-12 1200-12 800-12 Turn-8, 1-Vilayet 55.5"]
["6-12 1.7L, C'bury, 2009-12-17, 1550m, Good, Race 3, 3yo+ Mdn, Mdn 3+, $27000, ($0), J Parr, 9, Cd 54.5-0.0, (54.5), 1:34.20, (36.03), 16/1, Settled-7 1200-- 800-7 Turn-7, 1-Buffalo 56.5"]
["7-12 4.5L, C'bury, 2009-12-03, 1550m, Good, Race 2, 3yo+ Mdn Plate, Mdn 3+, $27000, ($0), C Brown, 7, Cd 56.0-0.0, (SW), 1:35.02, (35.99), 9/1, Settled-4 1200-- 800-- Turn-5, 1-I Don't Recall 58.0"]
["10 Often Away (9) 55.0kg 4yo b/br m",null,null,"Trainer: John Thompson at Morphettville",null,null,"Jockey: P Gatt"]
["Colours: Royal blue, green and gold logo, green sleeves, gold cap and pom pom",null,null,"Breeding: Hussonet (USA) - Dashing Granada by Keltrice"]
["Owners: Patinack Farm Racing Syndicate (mgr: N L Tinkler)"]
["Career:","Earnings:","Win: 0.0%","API:","First Up:","Second Up:","Distance:","Track:"]
["2010-02-02T07:00:00",8000,"Place: 57.1%",1.1000000000000001,"3:0-0-0","2010-01-01T02:00:00","3:0-0-1","1:0-1-0"]
["Fast:","Good:","Dead:","Slow:","Heavy:"]
["0:0-0-0","2010-02-02T05:00:00","0:0-0-0","2:0-0-0","0:0-0-0"]
["2-13 0.1L, Gawlr, 2010-11-17, 1200m, Good, Race 3, 4yo+ M Mdn, Mdn 4+ m, $10000, ($1800), T Pannell, 13, Cd 56.5-0.0, (SW), 1:12.22, (36.40), 25/10, Settled-10 1200-- 800-- Turn-8, 1-Rippa Matilla 56.5"]
["2-10 0.1L, MorhPk, 2010-11-04, 1250m, Good, Race 1, 3yo+ F&m Mdn, Mdn 3+ fm, $10000, ($1800), T Pannell, 10, Cd 56.5-0.0, (SW), 1:15.57, (36.01), 9/1, Settled-10 1200-- 800-- Turn-9, 1-Fleet Riane 55.0"]
["4-10 4.6L, Strath, 2010-10-20, 1100m, Good, Race 3, 3yo+ F&m Mdn, Mdn 3+ fm, $10000, ($600), C Lever, 8, Cd 56.5-0.0, (SW), 1:06.89, (36.13), 45/10, Settled-9 1200-- 800-- Turn-9, 1-Golden Penny 54.5"]
["4-7 3.5L, H'bury, 2010-04-01, 1000m, Slow, Race 1, Mdn Plate, Mdn, $16000, ($800), B Avdulla, 2, Cd 55.5-0.0, (SW), 0:59.32, (35.87), 12/1, Settled-6 1200-- 800-- Turn-6, 1-Maypan 55.5"]
["3-9 0.5L, N'ctle, 2009-11-15, 900m, Good, Race 1, 3yo Mdn Plate, Mdn 3, $14000, ($1400), P Robl, 7, Cd 54.0-0.0, (SW), 0:52.98, (34.10), 10/9F, Settled-2 1200-- 800-- Turn-2, 1-It's Our Turn 54.0"]
["3-10 2.3L, H'bury, 2009-10-22, 1000m, Good, Race 1, Mdn Plate, Mdn, $16000, ($1600), C Munce, 7, Cd 53.5-0.0, (SW), 0:57.77, (34.34), 5/2F, Settled-4 1200-- 800-- Turn-3, 1-Dragon's Keep 55.5"]
["5-7 1.4L, H'bury, 2009-10-11, 1000m, Slow, Race 1, 3yo Mdn, Mdn 3, $14000, ($0), H Bowman, 6, Cd 56.0-0.0, (55.5), 0:58.89, (35.25), 9/2, Settled-3 1200-- 800-- Turn-3, 1-Whiner 56.5"]
["11 Promotional (8) 55.0kg 4yo b m",null,null,"Trainer: Leon Macdonald & Andrew Gluyas at Morphettville",null,null,"Jockey: C Lindop"]
["Colours: Pale blue, orange spot",null,null,"Breeding: Al Maher - Sutra by Jade Hunter"]
["Owners: Pukhraj Breeding & Racing Syndicate"]
["Career:","Earnings:","Win: 0.0%","API:","First Up:","Second Up:","Distance:","Track:"]
["1:0-0-0",0,"Place: 0.0%","00:00:00","1:0-0-0","0:0-0-0","0:0-0-0","1:0-0-0"]
["Fast:","Good:","Dead:","Slow:","Heavy:"]
["0:0-0-0","1:0-0-0","0:0-0-0","0:0-0-0","0:0-0-0"]
["6-9 4.8L, MorhPk, 2010-11-04, 1250m, Good, Race 2, 3yo+ F&m Mdn, Mdn fm, $10000, ($0), P Gatt, 4, Cd 56.5-0.0, (SW), 1:15.92, (34.77), 7/1, Settled-6 1200-- 800-- Turn-6, 1-Coquelet 53.5"]
["12 Red Savina (11) 55.0kg 4yo b m",null,null,"Trainer: M A Kavanagh at Flemington",null,null,"Jockey: S Price"]
["Colours: Royal blue, black and white checked sash and cap",null,null,"Breeding: Hussonet (USA) - Surprise Twist by Runyon"]
["Owners: G J Hannan, Mrs J R Hannan, D D Bruton & J Vaughan"]
["Career:","Earnings:","Win: 0.0%","API:","First Up:","Second Up:","Distance:","Track:"]
["2010-02-02T07:00:00",8400,"Place: 57.1%","1900-01-01T04:48:00","2:0-0-1","1:0-0-0","0:0-0-0","1:0-0-0"]
["Fast:","Good:","Dead:","Slow:","Heavy:"]
["0:0-0-0","3:0-0-1","3:0-2-0","0:0-0-0","1:0-0-1"]
["6-10 4.1L, MorhPk, 2010-11-04, 1250m, Good, Race 1, 3yo+ F&m Mdn, Mdn fm, $10000, ($0), S Price, 6, Cd 56.5-0.0, (SW), 1:15.57, (36.01), 8/11F, Settled-8 1200-- 800-- Turn-8, 1-Fleet Riane 55.0"]
["2-14 0.8L, Ball't, 2010-10-21, 1200m, Dead, Race 2, 3yo+ F&m Mdn, Mdn fm, $15000, ($2700), W Egan, 4, Cd 57.0-0.0, (SW), 1:13.12, (), 9/2, Settled-6 1200-- 800-- Turn-3, 1-Booklet 54.5"]
["2-10 0.5L, Ball't, 2010-10-06, 1200m, Dead, Race 2, 3yo+ F&m Mdn, Mdn fm, $15000, ($2700), M Rodd, 8, Cd 57.0-0.0, (SW), 1:13.89, (), 11/2, Settled-3 1200-- 800-- Turn-2, 1-Our Testament 57.0"]
["3-11 6.1L, Seymor, 2010-09-16, 1009m, Heavy, Race 3, 3yo+ Mdn, Mdn 3+, $15000, ($1300), M Rodd, 10, Cd 56.0-0.0, (SW), 1:00.71, (), 4/1, Settled-4 1200-- 800-- Turn-4, 1-Lady Dom 56.0"]
["7-9 6.1L, GeeSyn, 2010-08-27, 1100m, Good, Race 1, 3yo+ Mdn Plate, Mdn 3+, $13000, ($200), W Egan, 1, Cd 56.0-0.0, (SW), 1:05.60, (34.23), 9/1, Settled-5 1200-- 800-- Turn-6, 1-Too Deadly 55.5"]
["3-12 2.3L, GeeSyn, 2010-08-06, 1000m, Good, Race 3, 4yo+ Mdn Plate, Mdn 4+, $13000, ($1100), M Rodd, 9, Cd 56.0-0.0, (SW), 0:58.92, (33.88), 4/1, Settled-1 1200-- 800-- Turn-1, 1-Diamondcowboy 58.0"]
["6-11 3.5L, G'long, 2009-09-11, 1340m, Dead, Race 4, 3yo Mdn, Mdn 3, $13000, ($200), W Egan, 11, Cd 55.0-0.0, (SW), 1:19.76, (35.06), 14/1, Settled-10 1200-- 800-- Turn-10, 1-Rebel Truce 57.0"]
["13 September Rain (4) 53.5kg 3yo b f",null,null,"Trainer: P C Barns at Morphettville",null,null,"Jockey: J Potter"]
["Colours: White, pink stripes, black cap",null,null,"Breeding: Blevic - Artful Gold by Made Of Gold"]
["Owners: I H Ravenscroft, M R Ravenscroft, P J Johnson, B R Turvey, M A Ricciuto, C S Clarke, W J Butterfield, J Hazeal, S Hornhardt & M"]
["Career:","Earnings:","Win: 0.0%","API:","First Up:","Second Up:","Distance:","Track:"]
["2:0-0-0",600,"Place: 0.0%",0.3,"1:0-0-0","1:0-0-0","0:0-0-0","2:0-0-0"]
["Fast:","Good:","Dead:","Slow:","Heavy:"]
["0:0-0-0","2:0-0-0","0:0-0-0","0:0-0-0","0:0-0-0"]
["4-9 3.9L, MorhPk, 2010-11-04, 1250m, Good, Race 2, 3yo+ F&m Mdn, Mdn fm, $10000, ($600), J Potter, 3, Cd 55.0-0.0, (SW), 1:15.92, (34.77), 6/1, Settled-4 1200-- 800-- Turn-4, 1-Coquelet 53.5"]
["6-8 7.3L, MorhPk, 2010-10-04, 1000m, Good, Race 4, 3yo F Mdn, Mdn 3 f, $10000, ($0), C Lindop, 6, Cd 56.5-0.0, (SW), 0:58.73, (35.43), 10/1, Settled-7 1200-- 800-- Turn-7, 1-Amy's Glen 56.5"]
["14 Twilight Dancer (10) 53.5kg 3yo ch f",null,null,"Trainer: W A Bogarts at Hope Forest",null,null,"Jockey: L Hopwood"]
["Colours: Red, white star",null,null,"Breeding: Real Jester - Cross Me Not by Bellotto"]
["Owners: W A Bogarts & J K Walker"]
["Career:","Earnings:","Win: 0.0%","API:","First Up:","Second Up:","Distance:","Track:"]
["4:0-1-0",4600,"Place: 25.0%",1.1000000000000001,"2:0-1-0","2:0-0-0","0:0-0-0","2:0-1-0"]
["Fast:","Good:","Dead:","Slow:","Heavy:"]
["0:0-0-0","4:0-1-0","0:0-0-0","0:0-0-0","0:0-0-0"]
["5-13 3.8L, Mphvl, 2010-11-02, 1100m, Good, Race 3, 3yo F Mdn, Mdn 3 f, $10000, ($0), L Hopwood, 9, Cd 55.0--1.5, (SW), 1:05.04, (35.43), 8/1, Settled-12 1200-- 800-- Turn-12, 1-Tigress Joy 56.5"]
["4-13 4.2L, Gawlr, 2010-10-06, 1200m, Good, Race 4, 3yo Mdn, Mdn 3, $10000, ($600), L Hopwood, 3, Cd 54.5-0.0, (SW), 1:12.23, (36.48), 8/1, Settled-6 1200-- 800-- Turn-5, 1-It's Home 56.5"]
["9-12 7.6L, MorhPk, 2010-05-08, 1250m, Good, Race 2, 2yo Rst1, RS1MW 2, $32000, ($400), L Hopwood, 3, Cd 54.0--1.5, (54.5), 1:15.22, (37.89), 4/1, Settled-4 1200-- 800-- Turn-5, 1-Condelago 56.5"]
["2-14 1.5L, MorhPk, 2010-04-28, 1000m, Good, Race 2, 2yo Mdn Plate, Mdn 2, $10000, ($1800), L Hopwood, 2, Cd 53.0--1.5, (SW), 0:59.11, (36.35), 8/1, Settled-5 1200-- 800-- Turn-4, 1-Monegasque 56.5"]
["15 Boolcunda Gold (3) 55.5kg 3yo b g",null,null,"Trainer: B Dunn at Strathalbyn",null,null,"Jockey: J Frew"]
["Colours: Red and white hoops, royal blue and white hooped sleeves, red and white qtrd cap",null,null,"Breeding: O'Reilly (NZ) - Beat Ofa Heart (NZ) by Fasliyev"]
["Owners: M H Wauchope, P R Barrett, S Benson, B J Dunn & Mrs S Benson"]
["Career:","Earnings:","Win: 0.0%","API:","First Up:","Second Up:","Distance:","Track:"]
["2:0-0-0",0,"Place: 0.0%",0,"1:0-0-0","1:0-0-0","1:0-0-0","0:0-0-0"]
["Fast:","Good:","Dead:","Slow:","Heavy:"]
["0:0-0-0","1:0-0-0","1:0-0-0","0:0-0-0","0:0-0-0"]
["8-12 5.6L, Penola, 2010-11-14, 1400m, Dead, Race 3, 3yo+ Mdn, Mdn 3+, $8500, ($0), A Herrmann, 9, Cd 55.5-0.0, (SW), 1:28.00, (), 14/1, Settled-- 1200-- 800-- Turn--, 1-Double Hennessy 57.0"]
["9-13 10.3L, Gawlr, 2010-10-27, 1200m, Good, Race 2, 3yo Mdn, Mdn 3, $10000, ($0), J Potter, 5, Cd 56.5-0.0, (SW), 1:11.11, (34.81), 20/1, Settled-9 1200-- 800-- Turn-7, 1-Jeter 54.5"]
["16 Steely Resolve (5) 57.0kg 4yo b h",null,null,"Trainer: Jon O'Connor at Morphettville",null,null,"Jockey: T Pannell"]
["Colours: Maroon, gold, sleeves and cap",null,null,"Breeding: Refuse To Bend (IRE) - Spin About by Spinning World"]
["Owners: S Lee, M Lee, S W Kwong, A Cham, T D Marvin, J P Kwong, Y H Kwok & C L Chin"]
["Career:","Earnings:","Win: 0.0%","API:","First Up:","Second Up:","Distance:","Track:"]
["2:0-0-0",400,"Place: 0.0%","04:48:00","2:0-0-0","0:0-0-0","1:0-0-0","0:0-0-0"]
["Fast:","Good:","Dead:","Slow:","Heavy:"]
["0:0-0-0","1:0-0-0","0:0-0-0","1:0-0-0","0:0-0-0"]
["7-13 4.6L, Mphvl, 2010-11-02, 1200m, Good, Race 2, 3yo+ E&g Mdn, Mdn 3+ eg, $10000, ($0), D Tourneur, 10, Cd 57.0-0.0, (SW), 1:10.73, (35.62), 20/1, Settled-2 1200-- 800-- Turn-6, 1-Mavross 57.0"]
["8-13 5.5L, Mphvl, 2010-06-26, 1100m, Slow, Race 7, 3yo Hcp, Open 3, $40000, ($400), T Pannell, 10, Cd 54.0-0.0, (53.5), 1:06.16, (35.63), 100/1, Settled-9 1200-- 800-- Turn-7, 1-Streetcar Magic 57.5"]
["17 Mr Diligent (15) 55.5kg 3yo br g",null,null,"Trainer: W J Smart at Morphettville",null,null,"Jockey: T Pannell"]
["Colours: Light blue, royal blue, diagonal stripes, light blue cap",null,null,"Breeding: Blevic - Charlize by Euclase"]
["Owners: W J Smart"]
["Career:","Earnings:","Win: 0.0%","API:","First Up:","Second Up:","Distance:","Track:"]
["3:0-0-0",400,"Place: 0.0%",0.1,"2:0-0-0","1:0-0-0","0:0-0-0","1:0-0-0"]
["Fast:","Good:","Dead:","Slow:","Heavy:"]
["0:0-0-0","3:0-0-0","0:0-0-0","0:0-0-0","0:0-0-0"]
["11-12 11.6L, Gawlr, 2010-11-17, 1100m, Good, Race 2, 3yo+ E&g Mdn, Mdn 3+, $10000, ($0), T Pannell, 10, Cd 55.5-0.0, (SW), 1:04.90, (35.38), 100/1, Settled-- 1200-- 800-- Turn--, 1-Vintage Punch 55.5"]
["6-7 4.8L, Halidn, 2010-09-19, 1000m, Good, Race 1, 3yo Mdn, Mdn 3, $8000, ($0), T Pannell, 4, Cd 56.5-0.0, (SW), 0:58.84, (), 25/1, Settled-- 1200-- 800-- Turn--, 1-Stake Your Claim 54.5"]
["9-9 16.5L, MorhPk, 2010-05-15, 1000m, Good, Race 1, 2yo Hcp, Open 2, $40000, ($400), T Pannell, 4, Cd 55.5-0.0, (53.0), 0:58.75, (34.50), 40/1, Settled-8 1200-- 800-- Turn-8, 1-Spirited Eagle 57.5"]
["18 Deed Of Honor (6) 57.0kg 4yo b g",null,null,"Trainer: K J Matson at Oakbank",null,null,"Jockey: J Frew"]
["Colours: Black, pink spots",null,null,"Breeding: Gallo Di Ferro (USA) - Dance For Kate by Charnwood Forest"]
["Owners: K J Matson & Mrs L Matson"]
["Career:","Earnings:","Win: 0.0%","API:","First Up:","Second Up:","Distance:","Track:"]
["3:0-0-0",400,"Place: 0.0%","02:24:00","1:0-0-0","1:0-0-0","1:0-0-0","0:0-0-0"]
["Fast:","Good:","Dead:","Slow:","Heavy:"]
["0:0-0-0","2:0-0-0","1:0-0-0","0:0-0-0","0:0-0-0"]
["8-11 8.3L, Balakl, 2010-03-31, 1600m, Good, Race 4, 3yo+ Mdn, Mdn 3+, $10000, ($0), J Frew, 7, Cd 53.0--3.0, (SW), 1:37.99, (), 100/1, Settled-6 1200-- 800-5 Turn-5, 1-Lannaki 54.0"]
["10-12 11.6L, Oakbnk, 2010-03-13, 1400m, Dead, Race 3, 3yo Rst1, RS1MW 3, $32000, ($400), J Frew, 11, Cd 51.5--2.0, (53.5), 1:29.75, (), 300/1, Settled-7 1200-- 800-7 Turn-10, 1-Exalted Blonde 53.5"]
["15-16 10.5L, M.Brge, 2010-03-03, 1200m, Good, Race 4, 3yo+ Mdn, Mdn 3+, $10000, ($0), K Dyson, 10, Cd 54.5--1.5, (SW), 1:11.90, (), 30/1, Settled-16 1200-- 800-- Turn-16, 1-Andamooka Gem 56.0"]
["18 Pack Saddle (13) 57.0kg 4yo b g",null,null,"Trainer: G V Richards at Morphettville",null,null,"Jockey: M Hoppo"]
["Colours: Blue, white seams, hooped sleeves, white cap",null,null,"Breeding: Alannan (USA) - Rose Of Cudmore by Northern Adventure"]
["Owners: T R Hull, P P Sheehan, K J Dorward, I L Rodgers, L J Darling, J A Smith, L J Simpson, A M Murray, P J Blacker & Mrs M J Hill"]
["Career:","Earnings:","Win: 0.0%","API:","First Up:","Second Up:","Distance:","Track:"]
["3:0-0-0",0,"Place: 0.0%",0,"2:0-0-0","1:0-0-0","0:0-0-0","0:0-0-0"]
["Fast:","Good:","Dead:","Slow:","Heavy:"]
["0:0-0-0","3:0-0-0","0:0-0-0","0:0-0-0","0:0-0-0"]
["9-13 5.5L, Mphvl, 2010-11-02, 1200m, Good, Race 2, 3yo+ E&g Mdn, Mdn 3+ eg, $10000, ($0), M Hoppo, 9, Cd 57.0-0.0, (SW), 1:10.73, (35.62), 60/1, Settled-4 1200-- 800-- Turn-10, 1-Mavross 57.0"]
["12-12 15.6L, Mphvl, 2009-11-03, 1600m, Good, Race 3, 3yo+ Mdn, Mdn 3+, $7700, ($0), J Frew, 10, Cd 52.5--3.0, (SW), 1:37.16, (), 60/1, Settled-11 1200-11 800-11 Turn-11, 1-French Secret 57.0"]
["9-9 19.5L, Strath, 2009-10-21, 1100m, Good, Race 1, 3yo Hcp (c1), Cls 1 3, $8200, ($0), J Frew, 5, Cd 54.0--2.5, (54.0), 1:05.80, (), 20/1, Settled-9 1200-- 800-- Turn-9, 1-Miss Tuscan 54.5"]

{"sheet":"Race","index":5,"n_rows":44,"n_cols":14,"rows_kept":44,"cut":false,"hidden":false,"merged":[]}
[]
["MORPHETTVILLE",null,"AR 3","PAYING"]
[]
["2010-11-24","(THE PARKS) MAIDEN PLATE",null,null,"Fixed Price"]
["RADIO TAB","10-5-12-9",null,null,"Late Mail 10","1400M","SHOWERY","DEAD(4)"]
[]
[{"$nulls":6},"SCR 15 16 17 18"]
[10,null,"OFTEN AWAY",4.5,1.8]
[7,null,"BURGUNDY NOTES",null,12.8,null,"Sub Fav 5"]
[12,null,"RED SAVINA",null,1.6]
[]
["QN","7*10",203,null,null,null,"TF","10* 7*12",1171.9000000000001]
["EX","10* 7",187.1,null,null,null,"A2","7*10",36.6]
["F4","10* 7*12* 3",2793.4,{"$nulls":4},"10*12",4.2]
[null,"Jackpot",684.84,{"$nulls":4},"7*12",122.8]
["No.",null,"Name","01:15:00","Win","Plc",null,"Rider  ","Bar","Wght",null,"Form","L3S","Rtng"]
[1,null,"HOOSANG",42.5,93.4,14.3,null,"D ROBINSON",6,57,null,null,"7X6",86]
[2,null,"KOTOR",34.5,36.700000000000003,7.8,null,"S CAHILL",16,57,null,null,735,91]
[3,null,"RED HOT JEUNE",11,10,3.2,null,"M NEILSON",17,57,null,null,"X53",92]
[4,null,"SHIRAZ KNIGHT",45,68.900000000000006,11.4,null,"B HOPPO",1,57,null,null,"44X",85]
[5,null,"DRAFTED",5.8,3.1,1.6,null,"C LIONS(A)",2,55.5,null,null,"X23",94]
[6,null,"BAENA",45.9,98.2,20.7,null,"A PATTERSON",18,55,null,null,7,89]
[7,null,"BURGUNDY NOTES",37.299999999999997,73.400000000000006,12.8,null,"J MATTHEWS(A)",14,55,null,null,"2X7",82]
[8,null,"CHAMPAGNE JOURNEY",20.2,35.700000000000003,8,null,"T BAKER",12,55,null,null,244,87]
[9,null,"COCO LOCO",8.4,8.3000000000000007,2.2999999999999998,null,"D TOURNEUR",7,55,null,null,"23X",88]
[10,null,"OFTEN AWAY",3.1,4.5,1.8,null,"P GATT",9,55,null,null,422,98]
[11,null,"PROMOTIONAL",23.3,35.1,7.5,null,"C LINDOP",8,55,null,null,6,88]
[12,null,"RED SAVINA",6.9,4.8,1.6,null,"S PRICE",11,55,null,null,226,100]
[13,null,"SEPTEMBER RAIN",14.5,28.4,5.7,null,"J POTTER",4,53.5,null,null,64,89]
[14,null,"TWILIGHT DANCER",22.5,24.3,5.7,null,"L HOPWOOD(A)",10,53.5,null,null,"X45",89]
[15,null,"BOOLCUNDA GOLD",{"$nulls":4},"SCRATCHED",3]
[16,null,"STEELY RESOLVE",{"$nulls":4},"SCRATCHED",5]
[17,null,"MR DILIGENT",{"$nulls":4},"SCRATCHED",15]
[18,null,"PACK SADDLE",{"$nulls":4},"SCRATCHED",13]
[]
["UNiTAB Pool Totals"]
["WN",51707,"QN",6578,"TF",22428]
["PL",19833,"EX",3534,"F4",901]
[null,null,"A2",1551,"XD(3,4) $4481"]
[]
["<< AR  1  2  3  4  5  6  7  8  DD/TT/QD  XD Riders  Fixed Price >>"]
[]
["Help","Gambling Advice","TAB Home","Refresh"]
["© Copyright UNiTAB Ltd","Created: Wed, 24 Nov 2010 13:44:34 Aust EST"]

{"sheet":"Tables","index":6,"n_rows":95,"n_cols":44,"rows_kept":95,"cut":false,"hidden":false,"merged":[]}
[{"$nulls":20},"Track",{"$f":"Data!N2","v":"DEAD"},{"$f":"IF(V1=\"SLOW\",1,IF(V1=\"HEAVY\",1,0))","v":0}]
[]
["Exclude",null,"Exclude",null,"Exclude",null,"Exclude",null,"Exclude",null,"Exclude",null,"Exclude",null,"Exclude",null,"Exclude",null,"Exclude",null,"Exclude",null,"Exclude",null,"Exclude",null,"Exclude",null,"Exclude",null,"Exclude",null,"Exclude",null,"Exclude",null,"Exclude",null,"Exclude",null,"Exclude",null,"Exclude"]
["Tab Number",null,"Barrier",null,"Weight",null,"L/S Weight Change",null,"API",null,"Win%",null,"Place%",null,"Distance",null,"Track",null,"Course",null,"Wet",null,"Days L/S",null,"Days 2nd L/S",null,"Days 3rd L/S",null,"Class",null,"LS FP",null,"L/S Margin",null,"2nd LS FP",null,"2nd L/S Margin",null,"3rd LS FP",null,"3rd L/S Margin",null,"Qld Tab Rating"]
[{"$f":"IF(B$3<>\"\",\"\",1)","v":1},5,{"$f":"IF(D$3<>\"\",\"\",1)","v":1},5,{"$f":"IF(F$3<>\"\",\"\",70)","v":70},0,{"$f":"IF(H$3<>\"\",\"\",0+12)","v":12},0,{"$f":"IF(J$3<>\"\",\"\",1)","v":1},8,{"$f":"IF(L$3<>\"\",\"\",1)","v":1},8,{"$f":"IF(N$3<>\"\",\"\",1)","v":1},8,{"$f":"IF(P$3<>\"\",\"\",\"Y\")","v":"Y"},5,{"$f":"IF(R$3<>\"\",\"\",\"Y\")","v":"Y"},5,{"$f":"IF(T$3<>\"\",\"\",\"Y\")","v":"Y"},8,{"$f":"IF(W1=0,\"\",IF(V$3<>\"\",\"\",\"Y\"))","v":""},8,{"$f":"IF(X$3<>\"\",\"\",1)","v":1},3,{"$f":"IF(Z$3<>\"\",\"\",1)","v":1},3,{"$f":"IF(AB$3<>\"\",\"\",1)","v":1},3,{"$f":"IF(AD$3<>\"\",\"\",1)","v":1},-5,{"$f":"IF(AF$3<>\"\",\"\",1)","v":1},7,{"$f":"IF(AH$3<>\"\",\"\",0.5)","v":0.5},7,1,7,0.5,7,{"$f":"IF(AN$3<>\"\",\"\",1)","v":1},7,0.5,7,100,7]
[{"$f":"IF(B$3<>\"\",\"\",A5+1)","v":2},5,{"$f":"IF(D$3<>\"\",\"\",C5+1)","v":2},5,{"$f":"IF(F$3<>\"\",\"\",E5-0.5)","v":69.5},0,{"$f":"IF(H$3<>\"\",\"\",0+G5-0.5)","v":11.5},0,{"$f":"IF(J$3<>\"\",\"\",I5+1)","v":2},6,{"$f":"IF(L$3<>\"\",\"\",K5+1)","v":2},6,{"$f":"IF(N$3<>\"\",\"\",M5+1)","v":2},6,{"$f":"IF(P$3<>\"\",\"\",\"N\")","v":"N"},0,{"$f":"IF(R$3<>\"\",\"\",\"N\")","v":"N"},0,{"$f":"IF(T$3<>\"\",\"\",\"N\")","v":"N"},0,{"$f":"IF(W1=0,\"\",IF(V$3<>\"\",\"\",\"Y\"))","v":""},0,{"$f":"IF(X$3<>\"\",\"\",W5+1)","v":2},3,{"$f":"IF(Z$3<>\"\",\"\",Y5+1)","v":2},3,{"$f":"IF(AB$3<>\"\",\"\",AA5+1)","v":2},3,{"$f":"IF(AD$3<>\"\",\"\",2)","v":2},10,{"$f":"IF(AF$3<>\"\",\"\",AE5+1)","v":2},5,{"$f":"IF(AH$3<>\"\",\"\",AG5+0.5)","v":1},7,2,5,1,7,{"$f":"IF(AN$3<>\"\",\"\",AM5+1)","v":2},5,1,7,99,5]
[{"$f":"IF(B$3<>\"\",\"\",A6+1)","v":3},5,{"$f":"IF(D$3<>\"\",\"\",C6+1)","v":3},5,{"$f":"IF(F$3<>\"\",\"\",E6-0.5)","v":69},0,{"$f":"IF(H$3<>\"\",\"\",0+G6-0.5)","v":11},0,{"$f":"IF(J$3<>\"\",\"\",I6+1)","v":3},4,{"$f":"IF(L$3<>\"\",\"\",K6+1)","v":3},4,{"$f":"IF(N$3<>\"\",\"\",M6+1)","v":3},4,{"$nulls":8},{"$f":"IF(X$3<>\"\",\"\",W6+1)","v":3},3,{"$f":"IF(Z$3<>\"\",\"\",Y6+1)","v":3},3,{"$f":"IF(AB$3<>\"\",\"\",AA6+1)","v":3},3,{"$f":"IF(AD$3<>\"\",\"\",3)","v":3},0,{"$f":"IF(AF$3<>\"\",\"\",AE6+1)","v":3},3,{"$f":"IF(AH$3<>\"\",\"\",AG6+0.5)","v":1.5},5,3,3,1.5,5,3,3,1.5,5,98,3]
[4,3,4,3,68.5,0,10.5,0,4,3,4,3,4,3,{"$nulls":8},4,3,4,3,4,3,null,null,4,2,{"$f":"IF(AH$3<>\"\",\"\",AG7+0.5)","v":2},5,4,2,2,5,4,2,2,5,97,3]
[5,3,5,3,68,0,10,0,5,3,5,3,5,3,{"$nulls":8},5,5,5,3,5,3,null,null,5,2,2.5,5,5,2,2.5,5,5,2,2.5,5,96,3]
[6,3,6,3,67.5,0,9.5,0,6,2,6,2,6,2,{"$nulls":8},6,5,6,3,6,3,null,null,6,0,3,3,6,0,3,3,6,0,3,3,95,2]
[7,2,7,2,67,0,9,0,7,2,7,2,7,2,{"$nulls":8},7,5,7,3,7,3,null,null,7,0,3.5,2,7,0,3.5,2,7,0,3.5,2,94,2]
[8,2,8,2,66.5,0,8.5,0,8,2,8,2,8,2,{"$nulls":8},8,5,8,3,8,3,null,null,8,0,4,2,8,0,4,2,8,0,4,2,93,0]
[9,2,9,2,66,0,8,0,9,2,9,2,9,2,{"$nulls":8},9,5,9,3,9,3,null,null,9,0,4.5,2,9,0,4.5,2,9,0,4.5,2,92,0]
[10,1,10,1,65.5,0,7.5,0,10,2,10,2,10,2,{"$nulls":8},10,5,10,3,10,3,null,null,10,0,5,2,10,0,5,2,10,0,5,2,91,0]
[11,1,11,1,65,0,7,2,11,2,11,2,11,2,{"$nulls":8},11,3,11,3,11,3,null,null,0,0,5.5,0,0,0,5.5,0,0,0,5.5,0,90,0]
[12,1,12,1,64.5,0,6.5,2,12,0,12,0,12,0,{"$nulls":8},12,3,12,5,12,3,{"$nulls":4},6,0,null,null,6,0,null,null,6,0,89,0]
[13,0,13,0,64,0,6,2,13,0,13,0,13,0,{"$nulls":8},13,3,13,5,13,3,{"$nulls":4},6.5,0,null,null,6.5,0,null,null,6.5,0,88,0]
[14,0,14,0,63.5,0,5.5,2,14,0,14,0,14,0,{"$nulls":8},14,3,14,5,14,3,{"$nulls":4},7,0,null,null,7,0,null,null,7,0,87,0]
[15,0,15,0,63,0,5,5,15,0,15,0,15,0,{"$nulls":8},15,2,15,5,15,3,{"$nulls":4},7.5,0,null,null,7.5,0,null,null,7.5,0,86,0]
[16,0,16,0,62.5,0,4.5,5,16,0,16,0,16,0,{"$nulls":8},16,2,16,5,16,3,{"$nulls":4},8,0,null,null,8,0,null,null,8,0,85,0]
[17,0,17,0,62,0,4,5,17,0,17,0,17,0,{"$nulls":8},17,2,17,5,17,3,{"$nulls":4},8.5,0,null,null,8.5,0,null,null,8.5,0,0,0]
[18,0,18,0,61.5,0,3.5,5,18,0,18,0,18,0,{"$nulls":8},18,2,18,3,18,3,{"$nulls":4},9,0,null,null,9,0,null,null,9,0]
[19,0,19,0,61,1,3,5,19,0,19,0,19,0,{"$nulls":8},19,2,19,3,19,5,{"$nulls":4},9.5,0,null,null,9.5,0,null,null,9.5,0]
[20,0,20,0,60.5,1,2.5,5,20,0,20,0,20,0,{"$nulls":8},20,2,20,3,20,5,{"$nulls":4},10,0,null,null,10,0,null,null,10,0]
[21,0,21,0,60,1,2,3,21,0,21,0,21,0,{"$nulls":8},21,2,21,3,21,5,{"$nulls":4},{"$f":"IF(AH$3<>\"\",\"\",0)","v":0},5,null,null,0,5,null,null,0,5]
[22,0,22,0,59.5,2,1.5,3,22,0,22,0,22,0,{"$nulls":8},22,0,22,2,22,5]
[23,0,23,0,59,2,1,3,23,0,23,0,null,0,{"$nulls":8},23,0,23,2,23,5]
[24,0,24,0,58.5,3,0.5,3,24,0,24,0,{"$f":"IF(N$3<>\"\",\"\",Data!BS25)","v":""},0,{"$nulls":8},24,0,24,2,24,5]
[null,null,0,0,58,3,0,3,{"$nulls":14},25,0,25,2,25,3]
[{"$nulls":4},57.5,3,-0.5,3,{"$nulls":14},26,0,26,2,26,3]
[{"$nulls":4},57,5,-1,3,{"$nulls":14},27,0,27,2,27,3]
[{"$nulls":4},56.5,5,-1.5,3,{"$nulls":14},28,0,28,2,28,3]
[{"$nulls":4},56,5,-2,3,{"$nulls":14},29,0,29,0,29,2]
[{"$nulls":4},55.5,3,-2.5,5,{"$nulls":14},30,0,30,0,30,2]
[{"$nulls":4},55,3,-3,5,{"$nulls":14},31,0,31,0,31,2]
[{"$nulls":4},54.5,3,-3.5,5,null,null,null,{"$f":"IF(K36=\"\",\"\",K36/2.5)","v":""},{"$nulls":10},32,0,32,0,32,2]
[{"$nulls":4},54,2,-4,5,null,null,null,{"$f":"IF(K37=\"\",\"\",K37/10)","v":""},{"$nulls":10},33,0,33,0,33,2]
[{"$nulls":4},53.5,2,-4.5,5,null,null,null,"",{"$nulls":10},34,0,34,0,34,2]
[{"$nulls":4},53,1,-5,5,null,null,null,"",{"$nulls":10},35,0,35,0,35,2]
[{"$nulls":4},52.5,1,-5.5,2,null,null,null,"",{"$nulls":10},36,0,36,0,36,2]
[{"$nulls":4},52,1,-6,2,null,null,null,"",{"$nulls":10},37,0,37,0,37,0]
[{"$nulls":4},51.5,0,-6.5,2,null,null,null,"",{"$nulls":10},38,0,38,0,38,0]
[{"$nulls":4},51,0,-7,2,null,null,null,"",{"$nulls":10},39,0,39,0,39,0]
[{"$nulls":4},50.5,0,-7.5,0,null,null,null,"",{"$nulls":10},40,0,40,0,40,0]
[{"$nulls":4},50,0,-8,0,null,null,null,"",{"$nulls":10},41,0,41,0,41,0]
[{"$nulls":4},49.5,0,-8.5,0,null,null,null,"",{"$nulls":10},42,0,42,0,42,0]
[{"$nulls":4},49,0,-9,0,null,null,null,"",{"$nulls":10},43,0,43,0,43,0]
[{"$nulls":4},48.5,0,-9.5,0,null,null,null,"",{"$nulls":10},44,0,44,0,44,0]
[{"$nulls":4},48,0,-10,0,null,null,null,"",{"$nulls":10},45,0,45,0,45,0]
[{"$nulls":4},47.5,0,-10.5,0,null,null,null,"",{"$nulls":10},46,0,46,0,46,0]
[{"$nulls":4},47,0,-11,0,null,null,null,"",{"$nulls":10},47,0,47,0,47,0]
[{"$nulls":4},46.5,0,-11.5,0,null,null,null,"",{"$nulls":10},48,0,48,0,48,0]
[{"$nulls":4},46,0,-12,0,null,null,null,"",{"$nulls":10},49,0,49,0,49,0]
[{"$nulls":4},45.5,0,{"$nulls":5},"",{"$nulls":10},50,0,50,0,50,0]
[{"$nulls":4},45,0,{"$nulls":5},"",{"$nulls":10},51,0,51,0,51,0]
[{"$nulls":22},52,0,52,0,52,0]
[{"$nulls":22},53,0,53,0,53,0]
[{"$nulls":22},54,0,54,0,54,0]
[{"$nulls":22},55,0,55,0,55,0]
[{"$nulls":22},56,0,56,0,56,0]
[{"$nulls":22},57,0,57,0,57,0]
[{"$nulls":22},58,0,58,0,58,0]
[{"$nulls":22},59,0,59,0,59,0]
[{"$nulls":22},60,0,60,0,60,0]
[{"$nulls":22},61,0,61,0,61,0]
[{"$nulls":22},62,0,62,0,62,0]
[{"$nulls":22},63,0,63,0,63,0]
[{"$nulls":22},64,0,64,0,64,0]
[{"$nulls":22},65,0,65,0,65,0]
[{"$nulls":22},66,0,66,0,66,0]
[{"$nulls":22},{"$f":"IF(X$3<>\"\",\"\",W70+1)","v":67},0,{"$f":"IF(Z$3<>\"\",\"\",Y70+1)","v":67},0,{"$f":"IF(AB$3<>\"\",\"\",AA70+1)","v":67},0]
[{"$nulls":22},68,0,68,0,68,0]
[{"$nulls":22},69,0,69,0,69,0]
[{"$nulls":22},70,0,70,0,70,0]
[{"$nulls":22},71,0,71,0,71,0]
[{"$nulls":22},72,0,72,0,72,0]
[{"$nulls":22},73,0,73,0,73,0]
[{"$nulls":22},74,0,74,0,74,0]
[{"$nulls":22},75,0,75,0,75,0]
[{"$nulls":22},76,0,76,0,76,0]
[{"$nulls":22},77,0,77,0,77,0]
[{"$nulls":22},78,0,78,0,78,0]
[{"$nulls":22},79,0,79,0,79,0]
[{"$nulls":22},80,0,80,0,80,0]
[{"$nulls":22},81,0,81,0,81,0]
[{"$nulls":22},82,0,82,0,82,0]
[{"$nulls":22},83,0,83,0,83,0]
[{"$nulls":22},84,0,84,0,84,0]
[{"$nulls":22},85,0,85,0,85,0]
[{"$nulls":22},86,0,86,0,86,0]
[{"$nulls":22},87,0,87,0,87,0]
[{"$nulls":22},88,0,88,0,88,0]
[{"$nulls":22},89,0,89,0,89,0]
[{"$nulls":22},90,0,90,0,90,0]
[{"$nulls":22},0,0,0,0,0,0]

{"sheet":"Data","index":7,"n_rows":1162,"n_cols":140,"rows_kept":1162,"cut":false,"hidden":false,"merged":[[7,51,7,52],[8,51,8,52],[9,51,9,52],[1,51,1,52],[2,51,2,52],[3,51,3,52],[4,51,4,52],[5,51,5,52],[6,51,6,52],[10,51,10,52],[11,51,11,52],[12,51,12,52],[24,51,24,52],[13,51,13,52],[14,51,14,52],[15,51,15,52],[16,51,16,52],[17,51,17,52],[18,51,18,52],[19,51,19,52],[20,51,20,52],[21,51,21,52],[22,51,22,52],[23,51,23,52]]}
[{"$f":"A3","v":"http://formguide.cyberhorse.com.au/index.php/Form/form.html?formdate=2010-11-24&track=Bunbry&raceno=1"},{"$nulls":10},"END",{"$f":"IF(Form!A1=\"\",\"\",LEFT(Form!A1,FIND(\"/\",Form!A1)-3))","v":"Form - Morphettville Pk "},{"$f":"IF(M1=\"\",\"\",TRIM(MID(M1,7,20)))","v":"Morphettville Pk"},{"$f":"IF(ISERROR(LEFT(N1,FIND(\"-\",N1)-1)),IF(ISERROR(LEFT(N1,FIND(\" \",N1)-1)),N1,LEFT(N1,FIND(\" \",N1)-1)),LEFT(N1,FIND(\"-\",N1)-1))","v":"Morphettville"},{"$nulls":10},{"$f":"IF(AA1=\"\",\"\",IF(ISERROR(MID(AA1,FIND(\" \",AA1,1)+1,FIND(\"(\",AA1,1)-FIND(\" \",AA1,1)-2)),\"\",MID(AA1,FIND(\" \",AA1,1)+1,FIND(\"(\",AA1,1)-FIND(\" \",AA1,1)-2)))","v":""},"Form - Morphettville Pk 24/11/10",{"$nulls":24},"Name",null,"Tab No","Tab No","Barrier","Barrier","Weight","Weight",null,null,null,"LS/Weight","LS/Weight","API",null,"API","Win%",null,"Win%","Place%",null,"Place%",null,"D","Distance","Distance","T","Track","Track","C","Course","Course","w","Wet","Wet",null,"Days LS",null,"Days LS",null,"Days 2ndLS",null,"Days 2ndLS",null,"Days 3rdLS",null,"Days 3rdLS","Class",null,null,"Class",null,null,"LS FP","LS FP",{"$nulls":4},"LS Mrg","LS Mrg",null,null,"2nd LS FP","2nd LS FP",{"$nulls":4},"2nd LS Mrg","2nd LS Mrg",null,null,"3rd LS FP","3rd LS FP",{"$nulls":4},"3rd Las Mrg","3rd Las Mrg",null,"Qld Rtg",null,"Qld Rtg","Final Rating","Priceing",{"$f":"MIN(EG2:EG25)","v":{"$error":"#N/A"}},{"$f":"MAX(EG2:EG25)","v":{"$error":"#N/A"}}]
["http://formguide.cyberhorse.com.au/index.php/Form/form.html?formdate=2010-11-24&track=MorhPk&raceno=3",{"$nulls":11},"2010-11-24",{"$f":"IF(Race!H5=\"\",\"\",LEFT(Race!H5,FIND(\"(\",Race!H5)-1))","v":"DEAD"},{"$f":"IF(Form!A2=\"\",\"\",TRIM(MID(Form!A2,5,2)))","v":"3"},{"$f":"VLOOKUP(O1,N3:Y20,$O$2+1,FALSE)","v":"http://www.tabonline.com.au/2010/11/24/AR03.html"},{"$nulls":9},{"$f":"IF(AA2=\"\",\"\",IF(ISERROR(MID(AA2,FIND(\" \",AA2,1)+1,FIND(\"(\",AA2,1)-FIND(\" \",AA2,1)-2)),\"\",MID(AA2,FIND(\" \",AA2,1)+1,FIND(\"(\",AA2,1)-FIND(\" \",AA2,1)-2)))","v":""},"Race 3",{"$nulls":24},{"$f":"IF(Form!I5<>\"\",LEFT(Form!C5,FIND(\"(\",Form!C5)-2),\"\")","v":"Hoosang"},null,{"$f":"IF(AZ2=\"\",\"\",Form!A5)","v":1},{"$f":"IF($AZ2=\"\",\"\",IF(ISNA(VLOOKUP(BB2,Tables!A$5:B$100,2,FALSE)),\"0\",VLOOKUP(BB2,Tables!A$5:B$100,2,FALSE)))","v":5},{"$f":"IF($AZ2=\"\",\"\",VLOOKUP(AZ2,Race!$C$1:$N$100,7,FALSE))","v":6},{"$f":"IF($AZ2=\"\",\"\",IF(ISNA(VLOOKUP(BD2,Tables!C$5:D$100,2,FALSE)),\"0\",VLOOKUP(BD2,Tables!C$5:D$100,2,FALSE)))","v":3},{"$f":"IF(AZ2=\"\",\"\",Form!F5)","v":57},{"$f":"IF($AZ2=\"\",\"\",IF(ISNA(VLOOKUP(BF2,Tables!E$5:F$100,2,FALSE)),\"0\",VLOOKUP(BF2,Tables!E$5:F$100,2,FALSE)))","v":5},{"$f":"IF($AZ2=\"\",\"\",INDEX($AA$1:$AT$499,MATCH($AZ2,$Z$1:$Z$499,0)+7,13))","v":" Cd 57.0-0.0"},{"$f":"IF($AZ2=\"\",\"\",LEFT(BH2,FIND(\"-\",BH2)-1))","v":" Cd 57.0"},{"$f":"IF(BF2=\"\",\"\",BF2-BK2)","v":0},{"$f":"IF($AZ2=\"\",\"\",TRIM(MID(BI2,4,5)))","v":"57.0"},{"$f":"IF($AZ2=\"\",\"\",IF(ISERROR(BK2),0,IF(ISNA(VLOOKUP(BJ2,Tables!G$5:H$100,2,FALSE)),\"0\",VLOOKUP(BJ2,Tables!G5:H$100,2,FALSE))))","v":3},{"$f":"IF($AZ2=\"\",\"\",Form!G5)","v":0.3},{"$f":"IF(BM2=\"\",\"\",IF(RANK(BM2,$BM$2:$BM$32)<25,RANK(BM2,$BM$2:$BM$32),\"\"))","v":9},{"$f":"IF($AZ2=\"\",\"\",IF(ISNA(VLOOKUP(BN2,Tables!I$5:J$100,2,FALSE)),\"0\",VLOOKUP(BN2,Tables!I$5:J$100,2,FALSE)))","v":2},{"$f":"IF($AZ2=\"\",\"\",Form!H5)","v":0},{"$f":"IF(AZ2=\"\",\"\",IF(RANK(BP2,$BP$2:$BP$32)<25,RANK(BP2,$BP$2:$BP$32),\"\"))","v":1},{"$f":"IF($AZ2=\"\",\"\",IF(ISNA(VLOOKUP(BQ2,Tables!K$5:L$100,2,FALSE)),\"0\",VLOOKUP(BQ2,Tables!K$5:L$100,2,FALSE)))","v":8},{"$f":"IF($AZ2=\"\",\"\",Form!I5)","v":25},{"$f":"IF(AZ2=\"\",\"\",IF(RANK(BS2,$BS$2:$BS$32)<25,RANK(BS2,$BS$2:$BS$32),\"\"))","v":7},{"$f":"IF($AZ2=\"\",\"\",IF(ISNA(VLOOKUP(BT2,Tables!M$5:N$100,2,FALSE)),\"0\",VLOOKUP(BT2,Tables!M$5:N$100,2,FALSE)))","v":2},{"$f":"IF($AZ2=\"\",\"\",INDEX(Race!$D$1:$P$100,MATCH($AZ2,Race!$C$1:$C$100,0)+0,9))","v":0},{"$f":"IF($AZ2=\"\",\"\",IF(ISERROR(FIND(BW$1,$BV2,1)),\"\",BW$1))","v":""},{"$f":"IF(BW2<>\"\",\"Y\",\"N\")","v":"N"},{"$f":"IF($AZ2=\"\",\"\",IF(ISNA(VLOOKUP(BX2,Tables!O$5:P$100,2,FALSE)),0,VLOOKUP(BX2,Tables!O$5:P$100,2,FALSE)))","v":0},{"$f":"IF($AZ2=\"\",\"\",IF(ISERROR(FIND(BZ$1,$BV2,1)),\"\",BZ$1))","v":""},{"$f":"IF(BZ2<>\"\",\"Y\",\"N\")","v":"N"},{"$f":"IF($AZ2=\"\",\"\",IF(ISNA(VLOOKUP(CA2,Tables!Q$5:R$100,2,FALSE)),0,VLOOKUP(CA2,Tables!Q$5:R$100,2,FALSE)))","v":0},{"$f":"IF($AZ2=\"\",\"\",IF(ISERROR(FIND(CC$1,$BV2,1)),\"\",CC$1))","v":""},{"$f":"IF(CC2<>\"\",\"Y\",\"N\")","v":"N"},{"$f":"IF($AZ2=\"\",\"\",IF(ISNA(VLOOKUP(CD2,Tables!S$5:T$100,2,FALSE)),0,VLOOKUP(CD2,Tables!S$5:T$100,2,FALSE)))","v":0},{"$f":"IF($AZ2=\"\",\"\",IF(ISERROR(FIND(CF$1,$BV2,1)),\"\",CF$1))","v":""},{"$f":"IF(CF2<>\"\",\"Y\",\"N\")","v":"N"},{"$f":"IF($AZ2=\"\",\"\",IF(ISNA(VLOOKUP(CG2,Tables!U$5:V$100,2,FALSE)),0,VLOOKUP(CG2,Tables!U$5:V$100,2,FALSE)))","v":0},{"$f":"IF($AZ2=\"\",\"\",INDEX($AA$1:$AT$499,MATCH($AZ2,$Z$1:$Z$499,0)+7,3))","v":"2010-11-10"},{"$f":"IF(CI2=\"\",\"\",($M$2-CI2))","v":14},{"$f":"IF(CJ2>90,0,CJ2)","v":14},{"$f":"IF($AZ2=\"\",\"\",IF(ISERROR(CK2),0,IF(ISNA(VLOOKUP(CK2,Tables!W$5:X$100,2,FALSE)),\"0\",VLOOKUP(CK2,Tables!W$5:X$100,2,FALSE))))","v":3},{"$f":"IF($AZ2=\"\",\"\",INDEX($AA$1:$AT$499,MATCH($AZ2,$Z$1:$Z$499,0)+8,3))","v":"2010-07-28"},{"$f":"IF(CM2=\"\",\"\",$M$2-CM2)","v":119},{"$f":"IF(CN2>90,0,CN2)","v":0},{"$f":"IF($AZ2=\"\",\"\",IF(ISERROR(CO2),0,IF(ISNA(VLOOKUP(CO2,Tables!Y$5:Z$100,2,FALSE)),\"0\",VLOOKUP(CO2,Tables!Y$5:Z$100,2,FALSE))))","v":0},{"$f":"IF($AZ2=\"\",\"\",INDEX($AA$1:$AT$499,MATCH($AZ2,$Z$1:$Z$499,0)+9,3))","v":"2010-07-14"},{"$f":"IF(CQ2=\"\",\"\",$M$2-CQ2)","v":133},{"$f":"IF(CR2>90,0,CR2)","v":0},{"$f":"IF($AZ2=\"\",\"\",IF(ISERROR(CS2),0,IF(ISNA(VLOOKUP(CS2,Tables!AA$5:AB$100,2,FALSE)),\"0\",VLOOKUP(CS2,Tables!AA$5:AB$100,2,FALSE))))","v":0},{"$f":"IF($AZ2=\"\",\"\",INDEX($AA$1:$AT$499,MATCH($AZ2,$Z$1:$Z$499,0)+7,9))","v":10000},{"$f":"IF(CU2=\"\",\"\",(Form!$H$3-CU2)/CU2*100)","v":0},{"$f":"IF(CV2=\"\",\"\",IF(CV2>10,1,IF(CV2<-10,2,3)))","v":3},{"$f":"IF($AZ2=\"\",\"\",IF(ISERROR(CW2),0,IF(ISNA(VLOOKUP(CW2,Tables!AC$5:AD$100,2,FALSE)),\"0\",VLOOKUP(CW2,Tables!AC$5:AD$100,2,FALSE))))","v":0},{"$f":"IF($AZ2=\"\",\"\",INDEX($AA$1:$AT$499,MATCH($AZ2,$Z$1:$Z$499,0)+7,1))","v":"6-13 6.1L"},{"$f":"IF($CY2=\"\",\"\",CLEAN(LEFT(CY2,FIND(\"-\",CY2)-1)))","v":"6"},{"$f":"IF($CZ2=\"\",\"\",IF(0+CZ2>10,0,0+CZ2))","v":6},{"$f":"IF($AZ2=\"\",\"\",IF(ISERROR(DA2),0,IF(ISNA(VLOOKUP(DA2,Tables!AE$5:AF$100,2,FALSE)),\"0\",VLOOKUP(DA2,Tables!AE$5:AF$100,2,FALSE))))","v":0},{"$f":"IF(CY2=\"\",\"\",MID(CY2,FIND(CHAR(22),SUBSTITUTE(CY2,\" \",CHAR(22),LEN(CY2)-LEN(SUBSTITUTE(CY2,\" \",\"\"))))+1,255))","v":"6.1L"},{"$f":"IF($BH2=\"\",\"\",LEFT(DC2,FIND(\"L\",DC2)-1))","v":"6.1"},{"$f":"IF($BH2=\"\",\"\",ROUND(0+DD2/0.5,0)*0.5)","v":6},{"$f":"IF(DE2=\"\",\"\",IF(DA2=1,0,DE2))","v":6},{"$f":"IF(DF2=\"\",\"\",DF2)","v":6},{"$f":"IF($AZ2=\"\",\"\",IF(ISERROR(DG2),0,IF(ISNA(VLOOKUP(DF2,Tables!AG$5:AH$100,2,FALSE)),\"0\",VLOOKUP(DF2,Tables!AG$5:AH$100,2,FALSE))))","v":0},{"$f":"IF($AZ2=\"\",\"\",INDEX($AA$1:$AT$499,MATCH($AZ2,$Z$1:$Z$499,0)+8,1))","v":"7-10 9.5L"},{"$f":"IF($DI2=\"\",\"\",CLEAN(LEFT(DI2,FIND(\"-\",DI2)-1)))","v":"7"},{"$f":"IF($DJ2=\"\",\"\",IF(0+DJ2>10,0,0+DJ2))","v":7},{"$f":"IF($AZ2=\"\",\"\",IF(ISERROR(DK2),0,IF(ISNA(VLOOKUP(DK2,Tables!AI$5:AJ$100,2,FALSE)),\"0\",VLOOKUP(DK2,Tables!AI$5:AJ$100,2,FALSE))))","v":0},{"$f":"IF($BH2=\"\",\"\",RIGHT(DI2,FIND(\" \",DI2)-1))","v":"9.5L"},{"$f":"IF($BH2=\"\",\"\",LEFT(DM2,FIND(\"L\",DM2)-1))","v":"9.5"},{"$f":"IF($BH2=\"\",\"\",ROUND(0+DN2/0.5,0)*0.5)","v":9.5},{"$f":"IF(DO2=\"\",\"\",IF(DK2=1,0,DO2))","v":9.5},{"$f":"IF(DP2=\"\",\"\",DP2)","v":9.5},{"$f":"IF($AZ2=\"\",\"\",IF(ISERROR(DQ2),0,IF(ISNA(VLOOKUP(DP2,Tables!AK$5:AL$100,2,FALSE)),\"0\",VLOOKUP(DP2,Tables!AK$5:AL$100,2,FALSE))))","v":0},{"$f":"IF($AZ2=\"\",\"\",INDEX($AA$1:$AT$499,MATCH($AZ2,$Z$1:$Z$499,0)+9,1))","v":"3-12 1.6L"},{"$f":"IF($DI2=\"\",\"\",CLEAN(LEFT(DS2,FIND(\"-\",DS2)-1)))","v":"3"},{"$f":"IF($DT2=\"\",\"\",IF(ISERROR(IF(0+DT2>10,0,0+DT2)),0,IF(0+DT2>10,0,0+DT2)))","v":3},{"$f":"IF($AZ2=\"\",\"\",IF(ISERROR(DU2),0,IF(ISNA(VLOOKUP(DU2,Tables!AM$5:AN$100,2,FALSE)),\"0\",VLOOKUP(DU2,Tables!AM$5:AN$100,2,FALSE))))","v":3},{"$f":"IF($BH2=\"\",\"\",RIGHT(DS2,FIND(\" \",DS2)-1))","v":"1.6L"},{"$f":"IF($BH2=\"\",\"\",LEFT(DW2,FIND(\"L\",DW2)-1))","v":"1.6"},{"$f":"IF($BH2=\"\",\"\",ROUND(0+DX2/0.5,0)*0.5)","v":1.5},{"$f":"IF(DY2=\"\",\"\",IF(DU2=1,0,DY2))","v":1.5},{"$f":"IF(DZ2=\"\",\"\",DZ2)","v":1.5},{"$f":"IF($BB2=\"\",\"\",IF(ISERROR(EA2),0,IF(ISNA(VLOOKUP(DZ2,Tables!AO$5:AP$100,2,FALSE)),\"0\",VLOOKUP(DZ2,Tables!AO$5:AP$100,2,FALSE))))","v":5},{"$f":"IF(AZ2=\"\",\"\",VLOOKUP(AZ2,Race!$C$1:$N$100,12,FALSE))","v":86},{"$f":"IF($AZ2=\"\",\"\",CLEAN(TRIM(EC2)))","v":"86"},{"$f":"IF(ED2=\"\",\"\",0+ED2)","v":86},{"$f":"IF($BB2=\"\",\"\",IF(ISNA(VLOOKUP(EE2,Tables!AQ$5:AR$100,2,FALSE)),\"0\",VLOOKUP(EE2,Tables!AQ$5:AR$100,2,FALSE)))","v":0},{"$f":"IF(AZ2=\"\",\"\",IF(MainSheet!D9=\"Scratched\",\"\",BC2+BE2+BG2+BL2+BO2+BR2+BU2+BY2+CB2+CE2+CH2+CL2+CP2+CT2+CX2+DB2+DH2+DL2+DR2+DV2+EB2+EF2))","v":39},{"$f":"IF(EG2=\"\",\"\",IF($EI$1>0,EG2-$EI$1,EG2+$EI$1))","v":{"$error":"#N/A"}},{"$f":"IF(EH2=\"\",\"\",EH2+((EH2*EH2*1)/(IF($EI$1>0,140-$EI$1,140+$EI$1)-$EJ$1)))","v":{"$error":"#N/A"}}]
[{"$f":"IF(RaceLists!A3=\"\",\"\",IF(RaceLists!A3=\"END\",\"END\",IF(RaceLists!E3=\"\",\"\",getAddress(RaceLists!E3))))","v":"http://formguide.cyberhorse.com.au/index.php/Form/form.html?formdate=2010-11-24&track=Bunbry&raceno=1"},{"$nulls":11},{"$f":"IF(Meetings!B3=\"\",\"\",LEFT(Meetings!B3,FIND(\"(\",Meetings!B3)-2))","v":"DOOMBEN"},{"$f":"IF(M3=\"\",\"\",IF(ISERROR(LEFT(M3,FIND(\"-\",M3)-1)),IF(ISERROR(LEFT(M3,FIND(\" \",M3)-1)),M3,LEFT(M3,FIND(\" \",M3)-1)),LEFT(M3,FIND(\"-\",M3)-1)))","v":"DOOMBEN"},{"$f":"IF(Meetings!D3=\"\",\"\",getAddress(Meetings!D3))","v":"http://www.tabonline.com.au/2010/11/24/BR01.html"},{"$f":"IF(Meetings!E3=\"\",\"\",getAddress(Meetings!E3))","v":"http://www.tabonline.com.au/2010/11/24/BR02.html"},{"$f":"IF(Meetings!F3=\"\",\"\",getAddress(Meetings!F3))","v":"http://www.tabonline.com.au/2010/11/24/BR03.html"},{"$f":"IF(Meetings!G3=\"\",\"\",getAddress(Meetings!G3))","v":"http://www.tabonline.com.au/2010/11/24/BR04.html"},{"$f":"IF(Meetings!H3=\"\",\"\",getAddress(Meetings!H3))","v":"http://www.tabonline.com.au/2010/11/24/BR05.html"},{"$f":"IF(Meetings!I3=\"\",\"\",getAddress(Meetings!I3))","v":"http://www.tabonline.com.au/2010/11/24/BR06.html"},{"$f":"IF(Meetings!J3=\"\",\"\",getAddress(Meetings!J3))","v":"http://www.tabonline.com.au/2010/11/24/BR07.html"},{"$f":"IF(Meetings!K3=\"\",\"\",getAddress(Meetings!K3))","v":""},{"$f":"IF(Meetings!L3=\"\",\"\",getAddress(Meetings!L3))","v":""},{"$f":"IF(Meetings!M3=\"\",\"\",getAddress(Meetings!M3))","v":""},{"$f":"IF(Meetings!N3=\"\",\"\",getAddress(Meetings!N3))","v":""},"",7.4999999999999997E-2,{"$nulls":24},{"$f":"IF(Form!I6<>\"\",LEFT(Form!C6,FIND(\"(\",Form!C6)-2),\"\")","v":"Kotor"},null,{"$f":"IF(AZ3=\"\",\"\",Form!A6)","v":2},{"$f":"IF($AZ3=\"\",\"\",IF(ISNA(VLOOKUP(BB3,Tables!A$5:B$100,2,FALSE)),\"0\",VLOOKUP(BB3,Tables!A$5:B$100,2,FALSE)))","v":5},{"$f":"IF($AZ3=\"\",\"\",VLOOKUP(AZ3,Race!$C$1:$N$100,7,FALSE))","v":16},{"$f":"IF($AZ3=\"\",\"\",IF(ISNA(VLOOKUP(BD3,Tables!C$5:D$100,2,FALSE)),\"0\",VLOOKUP(BD3,Tables!C$5:D$100,2,FALSE)))","v":0},{"$f":"IF(AZ3=\"\",\"\",Form!F6)","v":57},{"$f":"IF($AZ3=\"\",\"\",IF(ISNA(VLOOKUP(BF3,Tables!E$5:F$100,2,FALSE)),\"0\",VLOOKUP(BF3,Tables!E$5:F$100,2,FALSE)))","v":5},{"$f":"IF($AZ3=\"\",\"\",INDEX($AA$1:$AT$499,MATCH($AZ3,$Z$1:$Z$499,0)+7,13))","v":" Cd 57.0-0.0"},{"$f":"IF($AZ3=\"\",\"\",LEFT(BH3,FIND(\"-\",BH3)-1))","v":" Cd 57.0"},{"$f":"IF(BF3=\"\",\"\",BF3-BK3)","v":0},{"$f":"IF($AZ3=\"\",\"\",TRIM(MID(BI3,4,5)))","v":"57.0"},{"$f":"IF($AZ3=\"\",\"\",IF(ISERROR(BK3),0,IF(ISNA(VLOOKUP(BJ3,Tables!G$5:H$100,2,FALSE)),\"0\",VLOOKUP(BJ3,Tables!G6:H$100,2,FALSE))))","v":3},{"$f":"IF($AZ3=\"\",\"\",Form!G6)","v":0.2},{"$f":"IF(BM3=\"\",\"\",IF(RANK(BM3,$BM$2:$BM$32)<25,RANK(BM3,$BM$2:$BM$32),\"\"))","v":11},{"$f":"IF($AZ3=\"\",\"\",IF(ISNA(VLOOKUP(BN3,Tables!I$5:J$100,2,FALSE)),\"0\",VLOOKUP(BN3,Tables!I$5:J$100,2,FALSE)))","v":2},{"$f":"IF($AZ3=\"\",\"\",Form!H6)","v":0},{"$f":"IF(AZ3=\"\",\"\",IF(RANK(BP3,$BP$2:$BP$32)<25,RANK(BP3,$BP$2:$BP$32),\"\"))","v":1},{"$f":"IF($AZ3=\"\",\"\",IF(ISNA(VLOOKUP(BQ3,Tables!K$5:L$100,2,FALSE)),\"0\",VLOOKUP(BQ3,Tables!K$5:L$100,2,FALSE)))","v":8},{"$f":"IF($AZ3=\"\",\"\",Form!I6)","v":25},{"$f":"IF(AZ3=\"\",\"\",IF(RANK(BS3,$BS$2:$BS$32)<25,RANK(BS3,$BS$2:$BS$32),\"\"))","v":7},{"$f":"IF($AZ3=\"\",\"\",IF(ISNA(VLOOKUP(BT3,Tables!M$5:N$100,2,FALSE)),\"0\",VLOOKUP(BT3,Tables!M$5:N$100,2,FALSE)))","v":2},{"$f":"IF($AZ3=\"\",\"\",INDEX(Race!$D$1:$P$100,MATCH($AZ3,Race!$C$1:$C$100,0)+0,9))","v":0},{"$f":"IF($AZ3=\"\",\"\",IF(ISERROR(FIND(BW$1,$BV3,1)),\"\",BW$1))","v":""},{"$f":"IF(BW3<>\"\",\"Y\",\"N\")","v":"N"},{"$f":"IF($AZ3=\"\",\"\",IF(ISNA(VLOOKUP(BX3,Tables!O$5:P$100,2,FALSE)),0,VLOOKUP(BX3,Tables!O$5:P$100,2,FALSE)))","v":0},{"$f":"IF($AZ3=\"\",\"\",IF(ISERROR(FIND(BZ$1,$BV3,1)),\"\",BZ$1))","v":""},{"$f":"IF(BZ3<>\"\",\"Y\",\"N\")","v":"N"},{"$f":"IF($AZ3=\"\",\"\",IF(ISNA(VLOOKUP(CA3,Tables!Q$5:R$100,2,FALSE)),0,VLOOKUP(CA3,Tables!Q$5:R$100,2,FALSE)))","v":0},{"$f":"IF($AZ3=\"\",\"\",IF(ISERROR(FIND(CC$1,$BV3,1)),\"\",CC$1))","v":""},{"$f":"IF(CC3<>\"\",\"Y\",\"N\")","v":"N"},{"$f":"IF($AZ3=\"\",\"\",IF(ISNA(VLOOKUP(CD3,Tables!S$5:T$100,2,FALSE)),0,VLOOKUP(CD3,Tables!S$5:T$100,2,FALSE)))","v":0},{"$f":"IF($AZ3=\"\",\"\",IF(ISERROR(FIND(CF$1,$BV3,1)),\"\",CF$1))","v":""},{"$f":"IF(CF3<>\"\",\"Y\",\"N\")","v":"N"},{"$f":"IF($AZ3=\"\",\"\",IF(ISNA(VLOOKUP(CG3,Tables!U$5:V$100,2,FALSE)),0,VLOOKUP(CG3,Tables!U$5:V$100,2,FALSE)))","v":0},{"$f":"IF($AZ3=\"\",\"\",INDEX($AA$1:$AT$499,MATCH($AZ3,$Z$1:$Z$499,0)+7,3))","v":"2010-11-04"},{"$f":"IF(CI3=\"\",\"\",$M$2-CI3)","v":20},{"$f":"IF(CJ3>90,0,CJ3)","v":20},{"$f":"IF($AZ3=\"\",\"\",IF(ISERROR(CK3),0,IF(ISNA(VLOOKUP(CK3,Tables!W$5:X$100,2,FALSE)),\"0\",VLOOKUP(CK3,Tables!W$5:X$100,2,FALSE))))","v":2},{"$f":"IF($AZ3=\"\",\"\",INDEX($AA$1:$AT$499,MATCH($AZ3,$Z$1:$Z$499,0)+8,3))","v":"2010-10-20"},{"$f":"IF(CM3=\"\",\"\",$M$2-CM3)","v":35},{"$f":"IF(CN3>90,0,CN3)","v":35},{"$f":"IF($AZ3=\"\",\"\",IF(ISERROR(CO3),0,IF(ISNA(VLOOKUP(CO3,Tables!Y$5:Z$100,2,FALSE)),\"0\",VLOOKUP(CO3,Tables!Y$5:Z$100,2,FALSE))))","v":0},{"$f":"IF($AZ3=\"\",\"\",INDEX($AA$1:$AT$499,MATCH($AZ3,$Z$1:$Z$499,0)+9,3))","v":"2010-09-29"},{"$f":"IF(CQ3=\"\",\"\",$M$2-CQ3)","v":56},{"$f":"IF(CR3>90,0,CR3)","v":56},{"$f":"IF($AZ3=\"\",\"\",IF(ISERROR(CS3),0,IF(ISNA(VLOOKUP(CS3,Tables!AA$5:AB$100,2,FALSE)),\"0\",VLOOKUP(CS3,Tables!AA$5:AB$100,2,FALSE))))","v":0},{"$f":"IF($AZ3=\"\",\"\",INDEX($AA$1:$AT$499,MATCH($AZ3,$Z$1:$Z$499,0)+7,9))","v":10000},{"$f":"IF(CU3=\"\",\"\",(Form!$H$3-CU3)/CU3*100)","v":0},{"$f":"IF(CV3=\"\",\"\",IF(CV3>10,1,IF(CV3<-10,2,3)))","v":3},{"$f":"IF($AZ3=\"\",\"\",IF(ISERROR(CW3),0,IF(ISNA(VLOOKUP(CW3,Tables!AC$5:AD$100,2,FALSE)),\"0\",VLOOKUP(CW3,Tables!AC$5:AD$100,2,FALSE))))","v":0},{"$f":"IF($AZ3=\"\",\"\",INDEX($AA$1:$AT$499,MATCH($AZ3,$Z$1:$Z$499,0)+7,1))","v":"5-13 2.4L"},{"$f":"IF($CY3=\"\",\"\",CLEAN(LEFT(CY3,FIND(\"-\",CY3)-1)))","v":"5"},{"$f":"IF($CZ3=\"\",\"\",IF(0+CZ3>10,0,0+CZ3))","v":5},{"$f":"IF($AZ3=\"\",\"\",IF(ISERROR(DA3),0,IF(ISNA(VLOOKUP(DA3,Tables!AE$5:AF$100,2,FALSE)),\"0\",VLOOKUP(DA3,Tables!AE$5:AF$100,2,FALSE))))","v":2},"2.4L",{"$f":"IF($BH3=\"\",\"\",LEFT(DC3,FIND(\"L\",DC3)-1))","v":"2.4"},{"$f":"IF($BH3=\"\",\"\",ROUND(0+DD3/0.5,0)*0.5)","v":2.5},{"$f":"IF(DE3=\"\",\"\",IF(DA3=1,0,DE3))","v":2.5},{"$f":"IF(DF3=\"\",\"\",DF3)","v":2.5},{"$f":"IF($AZ3=\"\",\"\",IF(ISERROR(DG3),0,IF(ISNA(VLOOKUP(DF3,Tables!AG$5:AH$100,2,FALSE)),\"0\",VLOOKUP(DF3,Tables!AG$5:AH$100,2,FALSE))))","v":5},{"$f":"IF($AZ3=\"\",\"\",INDEX($AA$1:$AT$499,MATCH($AZ3,$Z$1:$Z$499,0)+8,1))","v":"3-13 2.6L"},{"$f":"IF($DI3=\"\",\"\",CLEAN(LEFT(DI3,FIND(\"-\",DI3)-1)))","v":"3"},{"$f":"IF($DJ3=\"\",\"\",IF(0+DJ3>10,0,0+DJ3))","v":3},{"$f":"IF($AZ3=\"\",\"\",IF(ISERROR(DK3),0,IF(ISNA(VLOOKUP(DK3,Tables!AI$5:AJ$100,2,FALSE)),\"0\",VLOOKUP(DK3,Tables!AI$5:AJ$100,2,FALSE))))","v":3},"2.6L","2.6",2.5,{"$f":"IF(DO3=\"\",\"\",IF(DK3=1,0,DO3))","v":2.5},{"$f":"IF(DP3=\"\",\"\",DP3)","v":2.5},{"$f":"IF($AZ3=\"\",\"\",IF(ISERROR(DQ3),0,IF(ISNA(VLOOKUP(DP3,Tables!AK$5:AL$100,2,FALSE)),\"0\",VLOOKUP(DP3,Tables!AK$5:AL$100,2,FALSE))))","v":5},{"$f":"IF($AZ3=\"\",\"\",INDEX($AA$1:$AT$499,MATCH($AZ3,$Z$1:$Z$499,0)+9,1))","v":"7-8 5.8L"},{"$f":"IF($DI3=\"\",\"\",CLEAN(LEFT(DS3,FIND(\"-\",DS3)-1)))","v":"7"},{"$f":"IF($DT3=\"\",\"\",IF(ISERROR(IF(0+DT3>10,0,0+DT3)),0,IF(0+DT3>10,0,0+DT3)))","v":7},{"$f":"IF($AZ3=\"\",\"\",IF(ISERROR(DU3),0,IF(ISNA(VLOOKUP(DU3,Tables!AM$5:AN$100,2,FALSE)),\"0\",VLOOKUP(DU3,Tables!AM$5:AN$100,2,FALSE))))","v":0},{"$f":"IF($BH3=\"\",\"\",RIGHT(DS3,FIND(\" \",DS3)-1))","v":".8L"},{"$f":"IF($BH3=\"\",\"\",LEFT(DW3,FIND(\"L\",DW3)-1))","v":".8"},1,{"$f":"IF(DY3=\"\",\"\",IF(DU3=1,0,DY3))","v":1},{"$f":"IF(DZ3=\"\",\"\",DZ3)","v":1},{"$f":"IF($BB3=\"\",\"\",IF(ISERROR(EA3),0,IF(ISNA(VLOOKUP(DZ3,Tables!AO$5:AP$100,2,FALSE)),\"0\",VLOOKUP(DZ3,Tables!AO$5:AP$100,2,FALSE))))","v":7},{"$f":"IF(AZ3=\"\",\"\",VLOOKUP(AZ3,Race!$C$1:$N$100,12,FALSE))","v":91},{"$f":"IF($AZ3=\"\",\"\",CLEAN(TRIM(EC3)))","v":"91"},{"$f":"IF(ED3=\"\",\"\",0+ED3)","v":91},{"$f":"IF($BB3=\"\",\"\",IF(ISNA(VLOOKUP(EE3,Tables!AQ$5:AR$100,2,FALSE)),\"0\",VLOOKUP(EE3,Tables!AQ$5:AR$100,2,FALSE)))","v":0},{"$f":"IF(AZ3=\"\",\"\",IF(MainSheet!D10=\"Scratched\",\"\",BC3+BE3+BG3+BL3+BO3+BR3+BU3+BY3+CB3+CE3+CH3+CL3+CP3+CT3+CX3+DB3+DH3+DL3+DR3+DV3+EB3+EF3))","v":49},{"$f":"IF(EG3=\"\",\"\",IF($EI$1>0,EG3-$EI$1,EG3+$EI$1))","v":{"$error":"#N/A"}},{"$f":"IF(EH3=\"\",\"\",EH3+((EH3*EH3*1)/(IF($EI$1>0,140-$EI$1,140+$EI$1)-$EJ$1)))","v":{"$error":"#N/A"}}]
[{"$f":"IF(RaceLists!A4=\"\",\"\",IF(RaceLists!A4=\"END\",\"END\",IF(RaceLists!E4=\"\",\"\",getAddress(RaceLists!E4))))","v":"http://formguide.cyberhorse.com.au/index.php/Form/form.html?formdate=2010-11-24&track=Bunbry&raceno=2"},{"$nulls":11},{"$f":"IF(Meetings!B4=\"\",\"\",LEFT(Meetings!B4,FIND(\"(\",Meetings!B4)-2))","v":"WARWICK FARM"},{"$f":"IF(M4=\"\",\"\",IF(ISERROR(LEFT(M4,FIND(\"-\",M4)-1)),IF(ISERROR(LEFT(M4,FIND(\" \",M4)-1)),M4,LEFT(M4,FIND(\" \",M4)-1)),LEFT(M4,FIND(\"-\",M4)-1)))","v":"WARWICK"},{"$f":"IF(Meetings!D4=\"\",\"\",getAddress(Meetings!D4))","v":"http://www.tabonline.com.au/2010/11/24/SR01.html"},{"$f":"IF(Meetings!E4=\"\",\"\",getAddress(Meetings!E4))","v":"http://www.tabonline.com.au/2010/11/24/SR02.html"},{"$f":"IF(Meetings!F4=\"\",\"\",getAddress(Meetings!F4))","v":"http://www.tabonline.com.au/2010/11/24/SR03.html"},{"$f":"IF(Meetings!G4=\"\",\"\",getAddress(Meetings!G4))","v":"http://www.tabonline.com.au/2010/11/24/SR04.html"},{"$f":"IF(Meetings!H4=\"\",\"\",getAddress(Meetings!H4))","v":"http://www.tabonline.com.au/2010/11/24/SR05.html"},{"$f":"IF(Meetings!I4=\"\",\"\",getAddress(Meetings!I4))","v":"http://www.tabonline.com.au/2010/11/24/SR06.html"},{"$f":"IF(Meetings!J4=\"\",\"\",getAddress(Meetings!J4))","v":"http://www.tabonline.com.au/2010/11/24/SR07.html"},{"$f":"IF(Meetings!K4=\"\",\"\",getAddress(Meetings!K4))","v":""},{"$f":"IF(Meetings!L4=\"\",\"\",getAddress(Meetings!L4))","v":""},{"$f":"IF(Meetings!M4=\"\",\"\",getAddress(Meetings!M4))","v":""},{"$f":"IF(Meetings!N4=\"\",\"\",getAddress(Meetings!N4))","v":""},"","#",{"$nulls":24},{"$f":"IF(Form!I7<>\"\",LEFT(Form!C7,FIND(\"(\",Form!C7)-2),\"\")","v":"Red Hot Jeune"},null,{"$f":"IF(AZ4=\"\",\"\",Form!A7)","v":3},{"$f":"IF($AZ4=\"\",\"\",IF(ISNA(VLOOKUP(BB4,Tables!A$5:B$100,2,FALSE)),\"0\",VLOOKUP(BB4,Tables!A$5:B$100,2,FALSE)))","v":5},{"$f":"IF($AZ4=\"\",\"\",VLOOKUP(AZ4,Race!$C$1:$N$100,7,FALSE))","v":17},{"$f":"IF($AZ4=\"\",\"\",IF(ISNA(VLOOKUP(BD4,Tables!C$5:D$100,2,FALSE)),\"0\",VLOOKUP(BD4,Tables!C$5:D$100,2,FALSE)))","v":0},{"$f":"IF(AZ4=\"\",\"\",Form!F7)","v":57},{"$f":"IF($AZ4=\"\",\"\",IF(ISNA(VLOOKUP(BF4,Tables!E$5:F$100,2,FALSE)),\"0\",VLOOKUP(BF4,Tables!E$5:F$100,2,FALSE)))","v":5},{"$f":"IF($AZ4=\"\",\"\",INDEX($AA$1:$AT$499,MATCH($AZ4,$Z$1:$Z$499,0)+7,13))","v":" Cd 57.0-0.0"}," Cd 57.0",0,"57.0",{"$f":"IF($AZ4=\"\",\"\",IF(ISERROR(BK4),0,IF(ISNA(VLOOKUP(BJ4,Tables!G$5:H$100,2,FALSE)),\"0\",VLOOKUP(BJ4,Tables!G7:H$100,2,FALSE))))","v":3},{"$f":"IF($AZ4=\"\",\"\",Form!G7)","v":0.4},8,{"$f":"IF($AZ4=\"\",\"\",IF(ISNA(VLOOKUP(BN4,Tables!I$5:J$100,2,FALSE)),\"0\",VLOOKUP(BN4,Tables!I$5:J$100,2,FALSE)))","v":2},{"$f":"IF($AZ4=\"\",\"\",Form!H7)","v":0},1,{"$f":"IF($AZ4=\"\",\"\",IF(ISNA(VLOOKUP(BQ4,Tables!K$5:L$100,2,FALSE)),\"0\",VLOOKUP(BQ4,Tables!K$5:L$100,2,FALSE)))","v":8},{"$f":"IF($AZ4=\"\",\"\",Form!I7)","v":40},5,{"$f":"IF($AZ4=\"\",\"\",IF(ISNA(VLOOKUP(BT4,Tables!M$5:N$100,2,FALSE)),\"0\",VLOOKUP(BT4,Tables!M$5:N$100,2,FALSE)))","v":3},{"$f":"IF($AZ4=\"\",\"\",INDEX(Race!$D$1:$P$100,MATCH($AZ4,Race!$C$1:$C$100,0)+0,9))","v":0},"","N",{"$f":"IF($AZ4=\"\",\"\",IF(ISNA(VLOOKUP(BX4,Tables!O$5:P$100,2,FALSE)),0,VLOOKUP(BX4,Tables!O$5:P$100,2,FALSE)))","v":0},"","N",{"$f":"IF($AZ4=\"\",\"\",IF(ISNA(VLOOKUP(CA4,Tables!Q$5:R$100,2,FALSE)),0,VLOOKUP(CA4,Tables!Q$5:R$100,2,FALSE)))","v":0},"","N",{"$f":"IF($AZ4=\"\",\"\",IF(ISNA(VLOOKUP(CD4,Tables!S$5:T$100,2,FALSE)),0,VLOOKUP(CD4,Tables!S$5:T$100,2,FALSE)))","v":0},"","N",{"$f":"IF($AZ4=\"\",\"\",IF(ISNA(VLOOKUP(CG4,Tables!U$5:V$100,2,FALSE)),0,VLOOKUP(CG4,Tables!U$5:V$100,2,FALSE)))","v":0},"2010-11-10",14,14,{"$f":"IF($AZ4=\"\",\"\",IF(ISERROR(CK4),0,IF(ISNA(VLOOKUP(CK4,Tables!W$5:X$100,2,FALSE)),\"0\",VLOOKUP(CK4,Tables!W$5:X$100,2,FALSE))))","v":3},"2010-10-27",28,28,{"$f":"IF($AZ4=\"\",\"\",IF(ISERROR(CO4),0,IF(ISNA(VLOOKUP(CO4,Tables!Y$5:Z$100,2,FALSE)),\"0\",VLOOKUP(CO4,Tables!Y$5:Z$100,2,FALSE))))","v":2},"2010-06-09",168,0,{"$f":"IF($AZ4=\"\",\"\",IF(ISERROR(CS4),0,IF(ISNA(VLOOKUP(CS4,Tables!AA$5:AB$100,2,FALSE)),\"0\",VLOOKUP(CS4,Tables!AA$5:AB$100,2,FALSE))))","v":0},10000,{"$f":"IF(CU4=\"\",\"\",(Form!$H$3-CU4)/CU4*100)","v":0},3,{"$f":"IF($AZ4=\"\",\"\",IF(ISERROR(CW4),0,IF(ISNA(VLOOKUP(CW4,Tables!AC$5:AD$100,2,FALSE)),\"0\",VLOOKUP(CW4,Tables!AC$5:AD$100,2,FALSE))))","v":0},"3-13 0.6L","3",3,{"$f":"IF($AZ4=\"\",\"\",IF(ISERROR(DA4),0,IF(ISNA(VLOOKUP(DA4,Tables!AE$5:AF$100,2,FALSE)),\"0\",VLOOKUP(DA4,Tables!AE$5:AF$100,2,FALSE))))","v":3},"0.6L","0.6",0.5,0.5,0.5,{"$f":"IF($AZ4=\"\",\"\",IF(ISERROR(DG4),0,IF(ISNA(VLOOKUP(DF4,Tables!AG$5:AH$100,2,FALSE)),\"0\",VLOOKUP(DF4,Tables!AG$5:AH$100,2,FALSE))))","v":7},"5-12 2.8L","5",5,{"$f":"IF($AZ4=\"\",\"\",IF(ISERROR(DK4),0,IF(ISNA(VLOOKUP(DK4,Tables!AI$5:AJ$100,2,FALSE)),\"0\",VLOOKUP(DK4,Tables!AI$5:AJ$100,2,FALSE))))","v":2},"2.8L","2.8",3,3,3,{"$f":"IF($AZ4=\"\",\"\",IF(ISERROR(DQ4),0,IF(ISNA(VLOOKUP(DP4,Tables!AK$5:AL$100,2,FALSE)),\"0\",VLOOKUP(DP4,Tables!AK$5:AL$100,2,FALSE))))","v":3},"7-12 4.3L","7",7,{"$f":"IF($AZ4=\"\",\"\",IF(ISERROR(DU4),0,IF(ISNA(VLOOKUP(DU4,Tables!AM$5:AN$100,2,FALSE)),\"0\",VLOOKUP(DU4,Tables!AM$5:AN$100,2,FALSE))))","v":0},"4.3L","4.3",4.5,4.5,4.5,{"$f":"IF($BB4=\"\",\"\",IF(ISERROR(EA4),0,IF(ISNA(VLOOKUP(DZ4,Tables!AO$5:AP$100,2,FALSE)),\"0\",VLOOKUP(DZ4,Tables!AO$5:AP$100,2,FALSE))))","v":2},{"$f":"IF(AZ4=\"\",\"\",VLOOKUP(AZ4,Race!$C$1:$N$100,12,FALSE))","v":92},"92",92,{"$f":"IF($BB4=\"\",\"\",IF(ISNA(VLOOKUP(EE4,Tables!AQ$5:AR$100,2,FALSE)),\"0\",VLOOKUP(EE4,Tables!AQ$5:AR$100,2,FALSE)))","v":0},{"$f":"IF(AZ4=\"\",\"\",IF(MainSheet!D11=\"Scratched\",\"\",BC4+BE4+BG4+BL4+BO4+BR4+BU4+BY4+CB4+CE4+CH4+CL4+CP4+CT4+CX4+DB4+DH4+DL4+DR4+DV4+EB4+EF4))","v":48},{"$error":"#N/A"},{"$error":"#N/A"}]
[{"$f":"IF(RaceLists!A5=\"\",\"\",IF(RaceLists!A5=\"END\",\"END\",IF(RaceLists!E5=\"\",\"\",getAddress(RaceLists!E5))))","v":"http://formguide.cyberhorse.com.au/index.php/Form/form.html?formdate=2010-11-24&track=Bunbry&raceno=3"},{"$nulls":11},{"$f":"IF(Meetings!B5=\"\",\"\",LEFT(Meetings!B5,FIND(\"(\",Meetings!B5)-2))","v":"SANDOWN"},"SANDOWN",{"$f":"IF(Meetings!D5=\"\",\"\",getAddress(Meetings!D5))","v":"http://www.tabonline.com.au/2010/11/24/MR01.html"},{"$f":"IF(Meetings!E5=\"\",\"\",getAddress(Meetings!E5))","v":"http://www.tabonline.com.au/2010/11/24/MR02.html"},{"$f":"IF(Meetings!F5=\"\",\"\",getAddress(Meetings!F5))","v":"http://www.tabonline.com.au/2010/11/24/MR03.html"},{"$f":"IF(Meetings!G5=\"\",\"\",getAddress(Meetings!G5))","v":"http://www.tabonline.com.au/2010/11/24/MR04.html"},{"$f":"IF(Meetings!H5=\"\",\"\",getAddress(Meetings!H5))","v":"http://www.tabonline.com.au/2010/11/24/MR05.html"},{"$f":"IF(Meetings!I5=\"\",\"\",getAddress(Meetings!I5))","v":"http://www.tabonline.com.au/2010/11/24/MR06.html"},{"$f":"IF(Meetings!J5=\"\",\"\",getAddress(Meetings!J5))","v":"http://www.tabonline.com.au/2010/11/24/MR07.html"},{"$f":"IF(Meetings!K5=\"\",\"\",getAddress(Meetings!K5))","v":""},{"$f":"IF(Meetings!L5=\"\",\"\",getAddress(Meetings!L5))","v":""},{"$f":"IF(Meetings!M5=\"\",\"\",getAddress(Meetings!M5))","v":""},{"$f":"IF(Meetings!N5=\"\",\"\",getAddress(Meetings!N5))","v":""},"",1,{"$nulls":24},{"$f":"IF(Form!I8<>\"\",LEFT(Form!C8,FIND(\"(\",Form!C8)-2),\"\")","v":"Shiraz Knight"},null,{"$f":"IF(AZ5=\"\",\"\",Form!A8)","v":4},{"$f":"IF($AZ5=\"\",\"\",IF(ISNA(VLOOKUP(BB5,Tables!A$5:B$100,2,FALSE)),\"0\",VLOOKUP(BB5,Tables!A$5:B$100,2,FALSE)))","v":3},{"$f":"IF($AZ5=\"\",\"\",VLOOKUP(AZ5,Race!$C$1:$N$100,7,FALSE))","v":1},{"$f":"IF($AZ5=\"\",\"\",IF(ISNA(VLOOKUP(BD5,Tables!C$5:D$100,2,FALSE)),\"0\",VLOOKUP(BD5,Tables!C$5:D$100,2,FALSE)))","v":5},{"$f":"IF(AZ5=\"\",\"\",Form!F8)","v":57},{"$f":"IF($AZ5=\"\",\"\",IF(ISNA(VLOOKUP(BF5,Tables!E$5:F$100,2,FALSE)),\"0\",VLOOKUP(BF5,Tables!E$5:F$100,2,FALSE)))","v":5}," Cd 54.0--3.0"," Cd 54.0",3,"54.0",{"$f":"IF($AZ5=\"\",\"\",IF(ISERROR(BK5),0,IF(ISNA(VLOOKUP(BJ5,Tables!G$5:H$100,2,FALSE)),\"0\",VLOOKUP(BJ5,Tables!G8:H$100,2,FALSE))))","v":5},{"$f":"IF($AZ5=\"\",\"\",Form!G8)","v":0.1},13,{"$f":"IF($AZ5=\"\",\"\",IF(ISNA(VLOOKUP(BN5,Tables!I$5:J$100,2,FALSE)),\"0\",VLOOKUP(BN5,Tables!I$5:J$100,2,FALSE)))","v":0},{"$f":"IF($AZ5=\"\",\"\",Form!H8)","v":0},1,{"$f":"IF($AZ5=\"\",\"\",IF(ISNA(VLOOKUP(BQ5,Tables!K$5:L$100,2,FALSE)),\"0\",VLOOKUP(BQ5,Tables!K$5:L$100,2,FALSE)))","v":8},{"$f":"IF($AZ5=\"\",\"\",Form!I8)","v":0},11,{"$f":"IF($AZ5=\"\",\"\",IF(ISNA(VLOOKUP(BT5,Tables!M$5:N$100,2,FALSE)),\"0\",VLOOKUP(BT5,Tables!M$5:N$100,2,FALSE)))","v":2},{"$f":"IF($AZ5=\"\",\"\",INDEX(Race!$D$1:$P$100,MATCH($AZ5,Race!$C$1:$C$100,0)+0,9))","v":0},"","N",{"$f":"IF($AZ5=\"\",\"\",IF(ISNA(VLOOKUP(BX5,Tables!O$5:P$100,2,FALSE)),0,VLOOKUP(BX5,Tables!O$5:P$100,2,FALSE)))","v":0},"","N",{"$f":"IF($AZ5=\"\",\"\",IF(ISNA(VLOOKUP(CA5,Tables!Q$5:R$100,2,FALSE)),0,VLOOKUP(CA5,Tables!Q$5:R$100,2,FALSE)))","v":0},"","N",{"$f":"IF($AZ5=\"\",\"\",IF(ISNA(VLOOKUP(CD5,Tables!S$5:T$100,2,FALSE)),0,VLOOKUP(CD5,Tables!S$5:T$100,2,FALSE)))","v":0},"","N",{"$f":"IF($AZ5=\"\",\"\",IF(ISNA(VLOOKUP(CG5,Tables!U$5:V$100,2,FALSE)),0,VLOOKUP(CG5,Tables!U$5:V$100,2,FALSE)))","v":0},"2010-09-12",73,73,{"$f":"IF($AZ5=\"\",\"\",IF(ISERROR(CK5),0,IF(ISNA(VLOOKUP(CK5,Tables!W$5:X$100,2,FALSE)),\"0\",VLOOKUP(CK5,Tables!W$5:X$100,2,FALSE))))","v":0},"2010-08-05",111,0,{"$f":"IF($AZ5=\"\",\"\",IF(ISERROR(CO5),0,IF(ISNA(VLOOKUP(CO5,Tables!Y$5:Z$100,2,FALSE)),\"0\",VLOOKUP(CO5,Tables!Y$5:Z$100,2,FALSE))))","v":0},"2010-07-21",126,0,{"$f":"IF($AZ5=\"\",\"\",IF(ISERROR(CS5),0,IF(ISNA(VLOOKUP(CS5,Tables!AA$5:AB$100,2,FALSE)),\"0\",VLOOKUP(CS5,Tables!AA$5:AB$100,2,FALSE))))","v":0},10000,{"$f":"IF(CU5=\"\",\"\",(Form!$H$3-CU5)/CU5*100)","v":0},3,{"$f":"IF($AZ5=\"\",\"\",IF(ISERROR(CW5),0,IF(ISNA(VLOOKUP(CW5,Tables!AC$5:AD$100,2,FALSE)),\"0\",VLOOKUP(CW5,Tables!AC$5:AD$100,2,FALSE))))","v":0},"4-12 4.5L","4",4,{"$f":"IF($AZ5=\"\",\"\",IF(ISERROR(DA5),0,IF(ISNA(VLOOKUP(DA5,Tables!AE$5:AF$100,2,FALSE)),\"0\",VLOOKUP(DA5,Tables!AE$5:AF$100,2,FALSE))))","v":2},"4.5L","4.5",4.5,4.5,4.5,{"$f":"IF($AZ5=\"\",\"\",IF(ISERROR(DG5),0,IF(ISNA(VLOOKUP(DF5,Tables!AG$5:AH$100,2,FALSE)),\"0\",VLOOKUP(DF5,Tables!AG$5:AH$100,2,FALSE))))","v":2},"4-10 2.1L","4",4,{"$f":"IF($AZ5=\"\",\"\",IF(ISERROR(DK5),0,IF(ISNA(VLOOKUP(DK5,Tables!AI$5:AJ$100,2,FALSE)),\"0\",VLOOKUP(DK5,Tables!AI$5:AJ$100,2,FALSE))))","v":2},"2.1L","2.1",2,2,2,{"$f":"IF($AZ5=\"\",\"\",IF(ISERROR(DQ5),0,IF(ISNA(VLOOKUP(DP5,Tables!AK$5:AL$100,2,FALSE)),\"0\",VLOOKUP(DP5,Tables!AK$5:AL$100,2,FALSE))))","v":5},"9-10 5.8L","9",9,{"$f":"IF($AZ5=\"\",\"\",IF(ISERROR(DU5),0,IF(ISNA(VLOOKUP(DU5,Tables!AM$5:AN$100,2,FALSE)),\"0\",VLOOKUP(DU5,Tables!AM$5:AN$100,2,FALSE))))","v":0},"5.8L","5.8",6,6,6,{"$f":"IF($BB5=\"\",\"\",IF(ISERROR(EA5),0,IF(ISNA(VLOOKUP(DZ5,Tables!AO$5:AP$100,2,FALSE)),\"0\",VLOOKUP(DZ5,Tables!AO$5:AP$100,2,FALSE))))","v":0},{"$f":"IF(AZ5=\"\",\"\",VLOOKUP(AZ5,Race!$C$1:$N$100,12,FALSE))","v":85},"85",85,{"$f":"IF($BB5=\"\",\"\",IF(ISNA(VLOOKUP(EE5,Tables!AQ$5:AR$100,2,FALSE)),\"0\",VLOOKUP(EE5,Tables!AQ$5:AR$100,2,FALSE)))","v":0},{"$f":"IF(AZ5=\"\",\"\",IF(MainSheet!D12=\"Scratched\",\"\",BC5+BE5+BG5+BL5+BO5+BR5+BU5+BY5+CB5+CE5+CH5+CL5+CP5+CT5+CX5+DB5+DH5+DL5+DR5+DV5+EB5+EF5))","v":39},{"$error":"#N/A"},{"$error":"#N/A"}]
[{"$f":"IF(RaceLists!A6=\"\",\"\",IF(RaceLists!A6=\"END\",\"END\",IF(RaceLists!E6=\"\",\"\",getAddress(RaceLists!E6))))","v":"http://formguide.cyberhorse.com.au/index.php/Form/form.html?formdate=2010-11-24&track=Bunbry&raceno=4"},{"$nulls":11},{"$f":"IF(Meetings!B6=\"\",\"\",LEFT(Meetings!B6,FIND(\"(\",Meetings!B6)-2))","v":"MORPHETTVILLE"},"MORPHETTVILLE",{"$f":"IF(Meetings!D6=\"\",\"\",getAddress(Meetings!D6))","v":"http://www.tabonline.com.au/2010/11/24/AR01.html"},{"$f":"IF(Meetings!E6=\"\",\"\",getAddress(Meetings!E6))","v":"http://www.tabonline.com.au/2010/11/24/AR02.html"},{"$f":"IF(Meetings!F6=\"\",\"\",getAddress(Meetings!F6))","v":"http://www.tabonline.com.au/2010/11/24/AR03.html"},{"$f":"IF(Meetings!G6=\"\",\"\",getAddress(Meetings!G6))","v":"http://www.tabonline.com.au/2010/11/24/AR04.html"},{"$f":"IF(Meetings!H6=\"\",\"\",getAddress(Meetings!H6))","v":"http://www.tabonline.com.au/2010/11/24/AR05.html"},{"$f":"IF(Meetings!I6=\"\",\"\",getAddress(Meetings!I6))","v":"http://www.tabonline.com.au/2010/11/24/AR06.html"},{"$f":"IF(Meetings!J6=\"\",\"\",getAddress(Meetings!J6))","v":"http://www.tabonline.com.au/2010/11/24/AR07.html"},{"$f":"IF(Meetings!K6=\"\",\"\",getAddress(Meetings!K6))","v":"http://www.tabonline.com.au/2010/11/24/AR08.html"},{"$f":"IF(Meetings!L6=\"\",\"\",getAddress(Meetings!L6))","v":""},{"$f":"IF(Meetings!M6=\"\",\"\",getAddress(Meetings!M6))","v":""},{"$f":"IF(Meetings!N6=\"\",\"\",getAddress(Meetings!N6))","v":""},"",2,{"$nulls":24},{"$f":"IF(Form!I9<>\"\",LEFT(Form!C9,FIND(\"(\",Form!C9)-2),\"\")","v":"Drafted"},null,{"$f":"IF(AZ6=\"\",\"\",Form!A9)","v":5},{"$f":"IF($AZ6=\"\",\"\",IF(ISNA(VLOOKUP(BB6,Tables!A$5:B$100,2,FALSE)),\"0\",VLOOKUP(BB6,Tables!A$5:B$100,2,FALSE)))","v":3},{"$f":"IF($AZ6=\"\",\"\",VLOOKUP(AZ6,Race!$C$1:$N$100,7,FALSE))","v":2},{"$f":"IF($AZ6=\"\",\"\",IF(ISNA(VLOOKUP(BD6,Tables!C$5:D$100,2,FALSE)),\"0\",VLOOKUP(BD6,Tables!C$5:D$100,2,FALSE)))","v":5},{"$f":"IF(AZ6=\"\",\"\",Form!F9)","v":55.5},{"$f":"IF($AZ6=\"\",\"\",IF(ISNA(VLOOKUP(BF6,Tables!E$5:F$100,2,FALSE)),\"0\",VLOOKUP(BF6,Tables!E$5:F$100,2,FALSE)))","v":3}," Cd 55.5-0.0"," Cd 55.5",0,"55.5",{"$f":"IF($AZ6=\"\",\"\",IF(ISERROR(BK6),0,IF(ISNA(VLOOKUP(BJ6,Tables!G$5:H$100,2,FALSE)),\"0\",VLOOKUP(BJ6,Tables!G9:H$100,2,FALSE))))","v":3},{"$f":"IF($AZ6=\"\",\"\",Form!G9)","v":1.1000000000000001},2,{"$f":"IF($AZ6=\"\",\"\",IF(ISNA(VLOOKUP(BN6,Tables!I$5:J$100,2,FALSE)),\"0\",VLOOKUP(BN6,Tables!I$5:J$100,2,FALSE)))","v":6},{"$f":"IF($AZ6=\"\",\"\",Form!H9)","v":0},1,{"$f":"IF($AZ6=\"\",\"\",IF(ISNA(VLOOKUP(BQ6,Tables!K$5:L$100,2,FALSE)),\"0\",VLOOKUP(BQ6,Tables!K$5:L$100,2,FALSE)))","v":8},{"$f":"IF($AZ6=\"\",\"\",Form!I9)","v":50},3,{"$f":"IF($AZ6=\"\",\"\",IF(ISNA(VLOOKUP(BT6,Tables!M$5:N$100,2,FALSE)),\"0\",VLOOKUP(BT6,Tables!M$5:N$100,2,FALSE)))","v":4},{"$f":"IF($AZ6=\"\",\"\",INDEX(Race!$D$1:$P$100,MATCH($AZ6,Race!$C$1:$C$100,0)+0,9))","v":0},"","N",{"$f":"IF($AZ6=\"\",\"\",IF(ISNA(VLOOKUP(BX6,Tables!O$5:P$100,2,FALSE)),0,VLOOKUP(BX6,Tables!O$5:P$100,2,FALSE)))","v":0},"","N",{"$f":"IF($AZ6=\"\",\"\",IF(ISNA(VLOOKUP(CA6,Tables!Q$5:R$100,2,FALSE)),0,VLOOKUP(CA6,Tables!Q$5:R$100,2,FALSE)))","v":0},"","N",{"$f":"IF($AZ6=\"\",\"\",IF(ISNA(VLOOKUP(CD6,Tables!S$5:T$100,2,FALSE)),0,VLOOKUP(CD6,Tables!S$5:T$100,2,FALSE)))","v":0},"","N",{"$f":"IF($AZ6=\"\",\"\",IF(ISNA(VLOOKUP(CG6,Tables!U$5:V$100,2,FALSE)),0,VLOOKUP(CG6,Tables!U$5:V$100,2,FALSE)))","v":0},"2010-11-17",7,7,{"$f":"IF($AZ6=\"\",\"\",IF(ISERROR(CK6),0,IF(ISNA(VLOOKUP(CK6,Tables!W$5:X$100,2,FALSE)),\"0\",VLOOKUP(CK6,Tables!W$5:X$100,2,FALSE))))","v":5},"2010-11-02",22,22,{"$f":"IF($AZ6=\"\",\"\",IF(ISERROR(CO6),0,IF(ISNA(VLOOKUP(CO6,Tables!Y$5:Z$100,2,FALSE)),\"0\",VLOOKUP(CO6,Tables!Y$5:Z$100,2,FALSE))))","v":2},"2010-06-09",168,0,{"$f":"IF($AZ6=\"\",\"\",IF(ISERROR(CS6),0,IF(ISNA(VLOOKUP(CS6,Tables!AA$5:AB$100,2,FALSE)),\"0\",VLOOKUP(CS6,Tables!AA$5:AB$100,2,FALSE))))","v":0},10000,{"$f":"IF(CU6=\"\",\"\",(Form!$H$3-CU6)/CU6*100)","v":0},3,{"$f":"IF($AZ6=\"\",\"\",IF(ISERROR(CW6),0,IF(ISNA(VLOOKUP(CW6,Tables!AC$5:AD$100,2,FALSE)),\"0\",VLOOKUP(CW6,Tables!AC$5:AD$100,2,FALSE))))","v":0},"3-12 1.3L","3",3,{"$f":"IF($AZ6=\"\",\"\",IF(ISERROR(DA6),0,IF(ISNA(VLOOKUP(DA6,Tables!AE$5:AF$100,2,FALSE)),\"0\",VLOOKUP(DA6,Tables!AE$5:AF$100,2,FALSE))))","v":3},"1.3L","1.3",1.5,1.5,1.5,{"$f":"IF($AZ6=\"\",\"\",IF(ISERROR(DG6),0,IF(ISNA(VLOOKUP(DF6,Tables!AG$5:AH$100,2,FALSE)),\"0\",VLOOKUP(DF6,Tables!AG$5:AH$100,2,FALSE))))","v":5},"2-13 0.8L","2",2,{"$f":"IF($AZ6=\"\",\"\",IF(ISERROR(DK6),0,IF(ISNA(VLOOKUP(DK6,Tables!AI$5:AJ$100,2,FALSE)),\"0\",VLOOKUP(DK6,Tables!AI$5:AJ$100,2,FALSE))))","v":5},"0.8L","0.8",1,1,1,{"$f":"IF($AZ6=\"\",\"\",IF(ISERROR(DQ6),0,IF(ISNA(VLOOKUP(DP6,Tables!AK$5:AL$100,2,FALSE)),\"0\",VLOOKUP(DP6,Tables!AK$5:AL$100,2,FALSE))))","v":7},"4-11 3.5L","4",4,{"$f":"IF($AZ6=\"\",\"\",IF(ISERROR(DU6),0,IF(ISNA(VLOOKUP(DU6,Tables!AM$5:AN$100,2,FALSE)),\"0\",VLOOKUP(DU6,Tables!AM$5:AN$100,2,FALSE))))","v":2},"3.5L","3.5",3.5,3.5,3.5,{"$f":"IF($BB6=\"\",\"\",IF(ISERROR(EA6),0,IF(ISNA(VLOOKUP(DZ6,Tables!AO$5:AP$100,2,FALSE)),\"0\",VLOOKUP(DZ6,Tables!AO$5:AP$100,2,FALSE))))","v":2},{"$f":"IF(AZ6=\"\",\"\",VLOOKUP(AZ6,Race!$C$1:$N$100,12,FALSE))","v":94},"94",94,{"$f":"IF($BB6=\"\",\"\",IF(ISNA(VLOOKUP(EE6,Tables!AQ$5:AR$100,2,FALSE)),\"0\",VLOOKUP(EE6,Tables!AQ$5:AR$100,2,FALSE)))","v":2},{"$f":"IF(AZ6=\"\",\"\",IF(MainSheet!D13=\"Scratched\",\"\",BC6+BE6+BG6+BL6+BO6+BR6+BU6+BY6+CB6+CE6+CH6+CL6+CP6+CT6+CX6+DB6+DH6+DL6+DR6+DV6+EB6+EF6))","v":65},{"$error":"#N/A"},{"$error":"#N/A"}]
[{"$f":"IF(RaceLists!A7=\"\",\"\",IF(RaceLists!A7=\"END\",\"END\",IF(RaceLists!E7=\"\",\"\",getAddress(RaceLists!E7))))","v":"http://formguide.cyberhorse.com.au/index.php/Form/form.html?formdate=2010-11-24&track=Bunbry&raceno=5"},{"$nulls":11},{"$f":"IF(Meetings!B7=\"\",\"\",LEFT(Meetings!B7,FIND(\"(\",Meetings!B7)-2))","v":"BUNBURY"},"BUNBURY",{"$f":"IF(Meetings!D7=\"\",\"\",getAddress(Meetings!D7))","v":"http://www.tabonline.com.au/2010/11/24/PR01.html"},{"$f":"IF(Meetings!E7=\"\",\"\",getAddress(Meetings!E7))","v":"http://www.tabonline.com.au/2010/11/24/PR02.html"},{"$f":"IF(Meetings!F7=\"\",\"\",getAddress(Meetings!F7))","v":"http://www.tabonline.com.au/2010/11/24/PR03.html"},{"$f":"IF(Meetings!G7=\"\",\"\",getAddress(Meetings!G7))","v":"http://www.tabonline.com.au/2010/11/24/PR04.html"},{"$f":"IF(Meetings!H7=\"\",\"\",getAddress(Meetings!H7))","v":"http://www.tabonline.com.au/2010/11/24/PR05.html"},{"$f":"IF(Meetings!I7=\"\",\"\",getAddress(Meetings!I7))","v":"http://www.tabonline.com.au/2010/11/24/PR06.html"},{"$f":"IF(Meetings!J7=\"\",\"\",getAddress(Meetings!J7))","v":"http://www.tabonline.com.au/2010/11/24/PR07.html"},{"$f":"IF(Meetings!K7=\"\",\"\",getAddress(Meetings!K7))","v":"http://www.tabonline.com.au/2010/11/24/PR08.html"},{"$f":"IF(Meetings!L7=\"\",\"\",getAddress(Meetings!L7))","v":""},{"$f":"IF(Meetings!M7=\"\",\"\",getAddress(Meetings!M7))","v":""},{"$f":"IF(Meetings!N7=\"\",\"\",getAddress(Meetings!N7))","v":""},"",3,{"$nulls":24},{"$f":"IF(Form!I10<>\"\",LEFT(Form!C10,FIND(\"(\",Form!C10)-2),\"\")","v":"Baena"},null,{"$f":"IF(AZ7=\"\",\"\",Form!A10)","v":6},{"$f":"IF($AZ7=\"\",\"\",IF(ISNA(VLOOKUP(BB7,Tables!A$5:B$100,2,FALSE)),\"0\",VLOOKUP(BB7,Tables!A$5:B$100,2,FALSE)))","v":3},{"$f":"IF($AZ7=\"\",\"\",VLOOKUP(AZ7,Race!$C$1:$N$100,7,FALSE))","v":18},{"$f":"IF($AZ7=\"\",\"\",IF(ISNA(VLOOKUP(BD7,Tables!C$5:D$100,2,FALSE)),\"0\",VLOOKUP(BD7,Tables!C$5:D$100,2,FALSE)))","v":0},{"$f":"IF(AZ7=\"\",\"\",Form!F10)","v":55},{"$f":"IF($AZ7=\"\",\"\",IF(ISNA(VLOOKUP(BF7,Tables!E$5:F$100,2,FALSE)),\"0\",VLOOKUP(BF7,Tables!E$5:F$100,2,FALSE)))","v":3}," Cd 53.5--3.0"," Cd 53.5",1.5,"53.5",{"$f":"IF($AZ7=\"\",\"\",IF(ISERROR(BK7),0,IF(ISNA(VLOOKUP(BJ7,Tables!G$5:H$100,2,FALSE)),\"0\",VLOOKUP(BJ7,Tables!G10:H$100,2,FALSE))))","v":3},{"$f":"IF($AZ7=\"\",\"\",Form!G10)","v":0},16,{"$f":"IF($AZ7=\"\",\"\",IF(ISNA(VLOOKUP(BN7,Tables!I$5:J$100,2,FALSE)),\"0\",VLOOKUP(BN7,Tables!I$5:J$100,2,FALSE)))","v":0},{"$f":"IF($AZ7=\"\",\"\",Form!H10)","v":0},1,{"$f":"IF($AZ7=\"\",\"\",IF(ISNA(VLOOKUP(BQ7,Tables!K$5:L$100,2,FALSE)),\"0\",VLOOKUP(BQ7,Tables!K$5:L$100,2,FALSE)))","v":8},{"$f":"IF($AZ7=\"\",\"\",Form!I10)","v":0},11,{"$f":"IF($AZ7=\"\",\"\",IF(ISNA(VLOOKUP(BT7,Tables!M$5:N$100,2,FALSE)),\"0\",VLOOKUP(BT7,Tables!M$5:N$100,2,FALSE)))","v":2},{"$f":"IF($AZ7=\"\",\"\",INDEX(Race!$D$1:$P$100,MATCH($AZ7,Race!$C$1:$C$100,0)+0,9))","v":0},"","N",{"$f":"IF($AZ7=\"\",\"\",IF(ISNA(VLOOKUP(BX7,Tables!O$5:P$100,2,FALSE)),0,VLOOKUP(BX7,Tables!O$5:P$100,2,FALSE)))","v":0},"","N",{"$f":"IF($AZ7=\"\",\"\",IF(ISNA(VLOOKUP(CA7,Tables!Q$5:R$100,2,FALSE)),0,VLOOKUP(CA7,Tables!Q$5:R$100,2,FALSE)))","v":0},"","N",{"$f":"IF($AZ7=\"\",\"\",IF(ISNA(VLOOKUP(CD7,Tables!S$5:T$100,2,FALSE)),0,VLOOKUP(CD7,Tables!S$5:T$100,2,FALSE)))","v":0},"","N",{"$f":"IF($AZ7=\"\",\"\",IF(ISNA(VLOOKUP(CG7,Tables!U$5:V$100,2,FALSE)),0,VLOOKUP(CG7,Tables!U$5:V$100,2,FALSE)))","v":0},"2010-11-04",20,20,{"$f":"IF($AZ7=\"\",\"\",IF(ISERROR(CK7),0,IF(ISNA(VLOOKUP(CK7,Tables!W$5:X$100,2,FALSE)),\"0\",VLOOKUP(CK7,Tables!W$5:X$100,2,FALSE))))","v":2},"00:00:00",40506,0,{"$f":"IF($AZ7=\"\",\"\",IF(ISERROR(CO7),0,IF(ISNA(VLOOKUP(CO7,Tables!Y$5:Z$100,2,FALSE)),\"0\",VLOOKUP(CO7,Tables!Y$5:Z$100,2,FALSE))))","v":0}," light green sleeves with dark green horse stripe",{"$error":"#VALUE!"},{"$error":"#VALUE!"},{"$f":"IF($AZ7=\"\",\"\",IF(ISERROR(CS7),0,IF(ISNA(VLOOKUP(CS7,Tables!AA$5:AB$100,2,FALSE)),\"0\",VLOOKUP(CS7,Tables!AA$5:AB$100,2,FALSE))))","v":0},10000,{"$f":"IF(CU7=\"\",\"\",(Form!$H$3-CU7)/CU7*100)","v":0},3,{"$f":"IF($AZ7=\"\",\"\",IF(ISERROR(CW7),0,IF(ISNA(VLOOKUP(CW7,Tables!AC$5:AD$100,2,FALSE)),\"0\",VLOOKUP(CW7,Tables!AC$5:AD$100,2,FALSE))))","v":0},"7-10 4.7L","7",7,{"$f":"IF($AZ7=\"\",\"\",IF(ISERROR(DA7),0,IF(ISNA(VLOOKUP(DA7,Tables!AE$5:AF$100,2,FALSE)),\"0\",VLOOKUP(DA7,Tables!AE$5:AF$100,2,FALSE))))","v":0},"4.7L","4.7",4.5,4.5,4.5,{"$f":"IF($AZ7=\"\",\"\",IF(ISERROR(DG7),0,IF(ISNA(VLOOKUP(DF7,Tables!AG$5:AH$100,2,FALSE)),\"0\",VLOOKUP(DF7,Tables!AG$5:AH$100,2,FALSE))))","v":2},"7 Burgundy Notes (14) 55.0kg 5yo b m",{"$error":"#VALUE!"},{"$error":"#VALUE!"},{"$f":"IF($AZ7=\"\",\"\",IF(ISERROR(DK7),0,IF(ISNA(VLOOKUP(DK7,Tables!AI$5:AJ$100,2,FALSE)),\"0\",VLOOKUP(DK7,Tables!AI$5:AJ$100,2,FALSE))))","v":0},"m",{"$error":"#VALUE!"},{"$error":"#VALUE!"},{"$error":"#VALUE!"},{"$error":"#VALUE!"},{"$f":"IF($AZ7=\"\",\"\",IF(ISERROR(DQ7),0,IF(ISNA(VLOOKUP(DP7,Tables!AK$5:AL$100,2,FALSE)),\"0\",VLOOKUP(DP7,Tables!AK$5:AL$100,2,FALSE))))","v":0},"Colours: Light green",{"$error":"#VALUE!"},{"$error":"#VALUE!"},{"$f":"IF($AZ7=\"\",\"\",IF(ISERROR(DU7),0,IF(ISNA(VLOOKUP(DU7,Tables!AM$5:AN$100,2,FALSE)),\"0\",VLOOKUP(DU7,Tables!AM$5:AN$100,2,FALSE))))","v":0},"ht green",{"$error":"#VALUE!"},{"$error":"#VALUE!"},{"$error":"#VALUE!"},{"$error":"#VALUE!"},{"$f":"IF($BB7=\"\",\"\",IF(ISERROR(EA7),0,IF(ISNA(VLOOKUP(DZ7,Tables!AO$5:AP$100,2,FALSE)),\"0\",VLOOKUP(DZ7,Tables!AO$5:AP$100,2,FALSE))))","v":0},{"$f":"IF(AZ7=\"\",\"\",VLOOKUP(AZ7,Race!$C$1:$N$100,12,FALSE))","v":89},"89",89,{"$f":"IF($BB7=\"\",\"\",IF(ISNA(VLOOKUP(EE7,Tables!AQ$5:AR$100,2,FALSE)),\"0\",VLOOKUP(EE7,Tables!AQ$5:AR$100,2,FALSE)))","v":0},{"$f":"IF(AZ7=\"\",\"\",IF(MainSheet!D14=\"Scratched\",\"\",BC7+BE7+BG7+BL7+BO7+BR7+BU7+BY7+CB7+CE7+CH7+CL7+CP7+CT7+CX7+DB7+DH7+DL7+DR7+DV7+EB7+EF7))","v":23},{"$error":"#N/A"},{"$error":"#N/A"}]
[{"$f":"IF(RaceLists!A8=\"\",\"\",IF(RaceLists!A8=\"END\",\"END\",IF(RaceLists!E8=\"\",\"\",getAddress(RaceLists!E8))))","v":"http://formguide.cyberhorse.com.au/index.php/Form/form.html?formdate=2010-11-24&track=Bunbry&raceno=6"},{"$nulls":11},{"$f":"IF(Meetings!B8=\"\",\"\",LEFT(Meetings!B8,FIND(\"(\",Meetings!B8)-2))","v":"KENILWORTH"},"KENILWORTH",{"$f":"IF(Meetings!D8=\"\",\"\",getAddress(Meetings!D8))","v":"http://www.tabonline.com.au/2010/11/24/AS01.html"},{"$f":"IF(Meetings!E8=\"\",\"\",getAddress(Meetings!E8))","v":"http://www.tabonline.com.au/2010/11/24/AS02.html"},{"$f":"IF(Meetings!F8=\"\",\"\",getAddress(Meetings!F8))","v":"http://www.tabonline.com.au/2010/11/24/AS03.html"},{"$f":"IF(Meetings!G8=\"\",\"\",getAddress(Meetings!G8))","v":"http://www.tabonline.com.au/2010/11/24/AS04.html"},{"$f":"IF(Meetings!H8=\"\",\"\",getAddress(Meetings!H8))","v":"http://www.tabonline.com.au/2010/11/24/AS05.html"},{"$f":"IF(Meetings!I8=\"\",\"\",getAddress(Meetings!I8))","v":"http://www.tabonline.com.au/2010/11/24/AS06.html"},{"$f":"IF(Meetings!J8=\"\",\"\",getAddress(Meetings!J8))","v":""},{"$f":"IF(Meetings!K8=\"\",\"\",getAddress(Meetings!K8))","v":""},{"$f":"IF(Meetings!L8=\"\",\"\",getAddress(Meetings!L8))","v":""},{"$f":"IF(Meetings!M8=\"\",\"\",getAddress(Meetings!M8))","v":""},{"$f":"IF(Meetings!N8=\"\",\"\",getAddress(Meetings!N8))","v":""},"",4,{"$nulls":24},{"$f":"IF(Form!I11<>\"\",LEFT(Form!C11,FIND(\"(\",Form!C11)-2),\"\")","v":"Burgundy Notes"},null,{"$f":"IF(AZ8=\"\",\"\",Form!A11)","v":7},{"$f":"IF($AZ8=\"\",\"\",IF(ISNA(VLOOKUP(BB8,Tables!A$5:B$100,2,FALSE)),\"0\",VLOOKUP(BB8,Tables!A$5:B$100,2,FALSE)))","v":2},{"$f":"IF($AZ8=\"\",\"\",VLOOKUP(AZ8,Race!$C$1:$N$100,7,FALSE))","v":0},{"$f":"IF($AZ8=\"\",\"\",IF(ISNA(VLOOKUP(BD8,Tables!C$5:D$100,2,FALSE)),\"0\",VLOOKUP(BD8,Tables!C$5:D$100,2,FALSE)))","v":0},{"$f":"IF(AZ8=\"\",\"\",Form!F11)","v":55},{"$f":"IF($AZ8=\"\",\"\",IF(ISNA(VLOOKUP(BF8,Tables!E$5:F$100,2,FALSE)),\"0\",VLOOKUP(BF8,Tables!E$5:F$100,2,FALSE)))","v":3}," Cd 55.0-0.0"," Cd 55.0",0,"55.0",{"$f":"IF($AZ8=\"\",\"\",IF(ISERROR(BK8),0,IF(ISNA(VLOOKUP(BJ8,Tables!G$5:H$100,2,FALSE)),\"0\",VLOOKUP(BJ8,Tables!G11:H$100,2,FALSE))))","v":3},{"$f":"IF($AZ8=\"\",\"\",Form!G11)","v":0.7},5,{"$f":"IF($AZ8=\"\",\"\",IF(ISNA(VLOOKUP(BN8,Tables!I$5:J$100,2,FALSE)),\"0\",VLOOKUP(BN8,Tables!I$5:J$100,2,FALSE)))","v":3},{"$f":"IF($AZ8=\"\",\"\",Form!H11)","v":0},1,{"$f":"IF($AZ8=\"\",\"\",IF(ISNA(VLOOKUP(BQ8,Tables!K$5:L$100,2,FALSE)),\"0\",VLOOKUP(BQ8,Tables!K$5:L$100,2,FALSE)))","v":8},{"$f":"IF($AZ8=\"\",\"\",Form!I11)","v":50},3,{"$f":"IF($AZ8=\"\",\"\",IF(ISNA(VLOOKUP(BT8,Tables!M$5:N$100,2,FALSE)),\"0\",VLOOKUP(BT8,Tables!M$5:N$100,2,FALSE)))","v":4},{"$f":"IF($AZ8=\"\",\"\",INDEX(Race!$D$1:$P$100,MATCH($AZ8,Race!$C$1:$C$100,0)+0,9))","v":0},"","N",{"$f":"IF($AZ8=\"\",\"\",IF(ISNA(VLOOKUP(BX8,Tables!O$5:P$100,2,FALSE)),0,VLOOKUP(BX8,Tables!O$5:P$100,2,FALSE)))","v":0},"","N",{"$f":"IF($AZ8=\"\",\"\",IF(ISNA(VLOOKUP(CA8,Tables!Q$5:R$100,2,FALSE)),0,VLOOKUP(CA8,Tables!Q$5:R$100,2,FALSE)))","v":0},"","N",{"$f":"IF($AZ8=\"\",\"\",IF(ISNA(VLOOKUP(CD8,Tables!S$5:T$100,2,FALSE)),0,VLOOKUP(CD8,Tables!S$5:T$100,2,FALSE)))","v":0},"","N",{"$f":"IF($AZ8=\"\",\"\",IF(ISNA(VLOOKUP(CG8,Tables!U$5:V$100,2,FALSE)),0,VLOOKUP(CG8,Tables!U$5:V$100,2,FALSE)))","v":0},"2010-11-10",14,14,{"$f":"IF($AZ8=\"\",\"\",IF(ISERROR(CK8),0,IF(ISNA(VLOOKUP(CK8,Tables!W$5:X$100,2,FALSE)),\"0\",VLOOKUP(CK8,Tables!W$5:X$100,2,FALSE))))","v":3},"2010-02-28",269,0,{"$f":"IF($AZ8=\"\",\"\",IF(ISERROR(CO8),0,IF(ISNA(VLOOKUP(CO8,Tables!Y$5:Z$100,2,FALSE)),\"0\",VLOOKUP(CO8,Tables!Y$5:Z$100,2,FALSE))))","v":0},"2010-02-03",294,0,{"$f":"IF($AZ8=\"\",\"\",IF(ISERROR(CS8),0,IF(ISNA(VLOOKUP(CS8,Tables!AA$5:AB$100,2,FALSE)),\"0\",VLOOKUP(CS8,Tables!AA$5:AB$100,2,FALSE))))","v":0},10000,{"$f":"IF(CU8=\"\",\"\",(Form!$H$3-CU8)/CU8*100)","v":0},3,{"$f":"IF($AZ8=\"\",\"\",IF(ISERROR(CW8),0,IF(ISNA(VLOOKUP(CW8,Tables!AC$5:AD$100,2,FALSE)),\"0\",VLOOKUP(CW8,Tables!AC$5:AD$100,2,FALSE))))","v":0},"7-13 6.2L","7",7,{"$f":"IF($AZ8=\"\",\"\",IF(ISERROR(DA8),0,IF(ISNA(VLOOKUP(DA8,Tables!AE$5:AF$100,2,FALSE)),\"0\",VLOOKUP(DA8,Tables!AE$5:AF$100,2,FALSE))))","v":0},"6.2L","6.2",6,6,6,{"$f":"IF($AZ8=\"\",\"\",IF(ISERROR(DG8),0,IF(ISNA(VLOOKUP(DF8,Tables!AG$5:AH$100,2,FALSE)),\"0\",VLOOKUP(DF8,Tables!AG$5:AH$100,2,FALSE))))","v":0},"2-6 3.0L","2",2,{"$f":"IF($AZ8=\"\",\"\",IF(ISERROR(DK8),0,IF(ISNA(VLOOKUP(DK8,Tables!AI$5:AJ$100,2,FALSE)),\"0\",VLOOKUP(DK8,Tables!AI$5:AJ$100,2,FALSE))))","v":5},".0L",".0",0,0,0,{"$f":"IF($AZ8=\"\",\"\",IF(ISERROR(DQ8),0,IF(ISNA(VLOOKUP(DP8,Tables!AK$5:AL$100,2,FALSE)),\"0\",VLOOKUP(DP8,Tables!AK$5:AL$100,2,FALSE))))","v":5},"2-10 2.3L","2",2,{"$f":"IF($AZ8=\"\",\"\",IF(ISERROR(DU8),0,IF(ISNA(VLOOKUP(DU8,Tables!AM$5:AN$100,2,FALSE)),\"0\",VLOOKUP(DU8,Tables!AM$5:AN$100,2,FALSE))))","v":5},"2.3L","2.3",2.5,2.5,2.5,{"$f":"IF($BB8=\"\",\"\",IF(ISERROR(EA8),0,IF(ISNA(VLOOKUP(DZ8,Tables!AO$5:AP$100,2,FALSE)),\"0\",VLOOKUP(DZ8,Tables!AO$5:AP$100,2,FALSE))))","v":5},{"$f":"IF(AZ8=\"\",\"\",VLOOKUP(AZ8,Race!$C$1:$N$100,12,FALSE))","v":0},"0",0,{"$f":"IF($BB8=\"\",\"\",IF(ISNA(VLOOKUP(EE8,Tables!AQ$5:AR$100,2,FALSE)),\"0\",VLOOKUP(EE8,Tables!AQ$5:AR$100,2,FALSE)))","v":0},{"$f":"IF(AZ8=\"\",\"\",IF(MainSheet!D15=\"Scratched\",\"\",BC8+BE8+BG8+BL8+BO8+BR8+BU8+BY8+CB8+CE8+CH8+CL8+CP8+CT8+CX8+DB8+DH8+DL8+DR8+DV8+EB8+EF8))","v":46},{"$error":"#N/A"},{"$error":"#N/A"}]
[{"$f":"IF(RaceLists!A9=\"\",\"\",IF(RaceLists!A9=\"END\",\"END\",IF(RaceLists!E9=\"\",\"\",getAddress(RaceLists!E9))))","v":"http://formguide.cyberhorse.com.au/index.php/Form/form.html?formdate=2010-11-24&track=Bunbry&raceno=7"},{"$nulls":11},{"$f":"IF(Meetings!B9=\"\",\"\",LEFT(Meetings!B9,FIND(\"(\",Meetings!B9)-2))","v":"CHEPSTOW"},"CHEPSTOW",{"$f":"IF(Meetings!D9=\"\",\"\",getAddress(Meetings!D9))","v":"http://www.tabonline.com.au/2010/11/24/CS01.html"},{"$f":"IF(Meetings!E9=\"\",\"\",getAddress(Meetings!E9))","v":"http://www.tabonline.com.au/2010/11/24/CS02.html"},{"$f":"IF(Meetings!F9=\"\",\"\",getAddress(Meetings!F9))","v":""},{"$f":"IF(Meetings!G9=\"\",\"\",getAddress(Meetings!G9))","v":""},{"$f":"IF(Meetings!H9=\"\",\"\",getAddress(Meetings!H9))","v":""},{"$f":"IF(Meetings!I9=\"\",\"\",getAddress(Meetings!I9))","v":""},{"$f":"IF(Meetings!J9=\"\",\"\",getAddress(Meetings!J9))","v":""},{"$f":"IF(Meetings!K9=\"\",\"\",getAddress(Meetings!K9))","v":""},{"$f":"IF(Meetings!L9=\"\",\"\",getAddress(Meetings!L9))","v":""},{"$f":"IF(Meetings!M9=\"\",\"\",getAddress(Meetings!M9))","v":""},{"$f":"IF(Meetings!N9=\"\",\"\",getAddress(Meetings!N9))","v":""},"",5,{"$nulls":24},{"$f":"IF(Form!I12<>\"\",LEFT(Form!C12,FIND(\"(\",Form!C12)-2),\"\")","v":"Champagne Journey"},null,{"$f":"IF(AZ9=\"\",\"\",Form!A12)","v":8},{"$f":"IF($AZ9=\"\",\"\",IF(ISNA(VLOOKUP(BB9,Tables!A$5:B$100,2,FALSE)),\"0\",VLOOKUP(BB9,Tables!A$5:B$100,2,FALSE)))","v":2},{"$f":"IF($AZ9=\"\",\"\",VLOOKUP(AZ9,Race!$C$1:$N$100,7,FALSE))","v":12},{"$f":"IF($AZ9=\"\",\"\",IF(ISNA(VLOOKUP(BD9,Tables!C$5:D$100,2,FALSE)),\"0\",VLOOKUP(BD9,Tables!C$5:D$100,2,FALSE)))","v":1},{"$f":"IF(AZ9=\"\",\"\",Form!F12)","v":55},{"$f":"IF($AZ9=\"\",\"\",IF(ISNA(VLOOKUP(BF9,Tables!E$5:F$100,2,FALSE)),\"0\",VLOOKUP(BF9,Tables!E$5:F$100,2,FALSE)))","v":3}," Cd 55.0-0.0"," Cd 55.0",0,"55.0",{"$f":"IF($AZ9=\"\",\"\",IF(ISERROR(BK9),0,IF(ISNA(VLOOKUP(BJ9,Tables!G$5:H$100,2,FALSE)),\"0\",VLOOKUP(BJ9,Tables!G12:H$100,2,FALSE))))","v":3},{"$f":"IF($AZ9=\"\",\"\",Form!G12)","v":0.5},7,{"$f":"IF($AZ9=\"\",\"\",IF(ISNA(VLOOKUP(BN9,Tables!I$5:J$100,2,FALSE)),\"0\",VLOOKUP(BN9,Tables!I$5:J$100,2,FALSE)))","v":2},{"$f":"IF($AZ9=\"\",\"\",Form!H12)","v":0},1,{"$f":"IF($AZ9=\"\",\"\",IF(ISNA(VLOOKUP(BQ9,Tables!K$5:L$100,2,FALSE)),\"0\",VLOOKUP(BQ9,Tables!K$5:L$100,2,FALSE)))","v":8},{"$f":"IF($AZ9=\"\",\"\",Form!I12)","v":12.5},10,{"$f":"IF($AZ9=\"\",\"\",IF(ISNA(VLOOKUP(BT9,Tables!M$5:N$100,2,FALSE)),\"0\",VLOOKUP(BT9,Tables!M$5:N$100,2,FALSE)))","v":2},{"$f":"IF($AZ9=\"\",\"\",INDEX(Race!$D$1:$P$100,MATCH($AZ9,Race!$C$1:$C$100,0)+0,9))","v":0},"","N",{"$f":"IF($AZ9=\"\",\"\",IF(ISNA(VLOOKUP(BX9,Tables!O$5:P$100,2,FALSE)),0,VLOOKUP(BX9,Tables!O$5:P$100,2,FALSE)))","v":0},"","N",{"$f":"IF($AZ9=\"\",\"\",IF(ISNA(VLOOKUP(CA9,Tables!Q$5:R$100,2,FALSE)),0,VLOOKUP(CA9,Tables!Q$5:R$100,2,FALSE)))","v":0},"","N",{"$f":"IF($AZ9=\"\",\"\",IF(ISNA(VLOOKUP(CD9,Tables!S$5:T$100,2,FALSE)),0,VLOOKUP(CD9,Tables!S$5:T$100,2,FALSE)))","v":0},"","N",{"$f":"IF($AZ9=\"\",\"\",IF(ISNA(VLOOKUP(CG9,Tables!U$5:V$100,2,FALSE)),0,VLOOKUP(CG9,Tables!U$5:V$100,2,FALSE)))","v":0},"2010-11-10",14,14,{"$f":"IF($AZ9=\"\",\"\",IF(ISERROR(CK9),0,IF(ISNA(VLOOKUP(CK9,Tables!W$5:X$100,2,FALSE)),\"0\",VLOOKUP(CK9,Tables!W$5:X$100,2,FALSE))))","v":3},"2010-10-24",31,31,{"$f":"IF($AZ9=\"\",\"\",IF(ISERROR(CO9),0,IF(ISNA(VLOOKUP(CO9,Tables!Y$5:Z$100,2,FALSE)),\"0\",VLOOKUP(CO9,Tables!Y$5:Z$100,2,FALSE))))","v":0},"2010-09-02",83,83,{"$f":"IF($AZ9=\"\",\"\",IF(ISERROR(CS9),0,IF(ISNA(VLOOKUP(CS9,Tables!AA$5:AB$100,2,FALSE)),\"0\",VLOOKUP(CS9,Tables!AA$5:AB$100,2,FALSE))))","v":0},10000,{"$f":"IF(CU9=\"\",\"\",(Form!$H$3-CU9)/CU9*100)","v":0},3,{"$f":"IF($AZ9=\"\",\"\",IF(ISERROR(CW9),0,IF(ISNA(VLOOKUP(CW9,Tables!AC$5:AD$100,2,FALSE)),\"0\",VLOOKUP(CW9,Tables!AC$5:AD$100,2,FALSE))))","v":0},"4-13 2.9L","4",4,{"$f":"IF($AZ9=\"\",\"\",IF(ISERROR(DA9),0,IF(ISNA(VLOOKUP(DA9,Tables!AE$5:AF$100,2,FALSE)),\"0\",VLOOKUP(DA9,Tables!AE$5:AF$100,2,FALSE))))","v":2},"2.9L","2.9",3,3,3,{"$f":"IF($AZ9=\"\",\"\",IF(ISERROR(DG9),0,IF(ISNA(VLOOKUP(DF9,Tables!AG$5:AH$100,2,FALSE)),\"0\",VLOOKUP(DF9,Tables!AG$5:AH$100,2,FALSE))))","v":3},"4-12 0.6L","4",4,{"$f":"IF($AZ9=\"\",\"\",IF(ISERROR(DK9),0,IF(ISNA(VLOOKUP(DK9,Tables!AI$5:AJ$100,2,FALSE)),\"0\",VLOOKUP(DK9,Tables!AI$5:AJ$100,2,FALSE))))","v":2},"0.6L","0.6",0.5,0.5,0.5,{"$f":"IF($AZ9=\"\",\"\",IF(ISERROR(DQ9),0,IF(ISNA(VLOOKUP(DP9,Tables!AK$5:AL$100,2,FALSE)),\"0\",VLOOKUP(DP9,Tables!AK$5:AL$100,2,FALSE))))","v":7},"2-15 1.5L","2",2,{"$f":"IF($AZ9=\"\",\"\",IF(ISERROR(DU9),0,IF(ISNA(VLOOKUP(DU9,Tables!AM$5:AN$100,2,FALSE)),\"0\",VLOOKUP(DU9,Tables!AM$5:AN$100,2,FALSE))))","v":5},"1.5L","1.5",1.5,1.5,1.5,{"$f":"IF($BB9=\"\",\"\",IF(ISERROR(EA9),0,IF(ISNA(VLOOKUP(DZ9,Tables!AO$5:AP$100,2,FALSE)),\"0\",VLOOKUP(DZ9,Tables!AO$5:AP$100,2,FALSE))))","v":5},{"$f":"IF(AZ9=\"\",\"\",VLOOKUP(AZ9,Race!$C$1:$N$100,12,FALSE))","v":87},"87",87,{"$f":"IF($BB9=\"\",\"\",IF(ISNA(VLOOKUP(EE9,Tables!AQ$5:AR$100,2,FALSE)),\"0\",VLOOKUP(EE9,Tables!AQ$5:AR$100,2,FALSE)))","v":0},{"$f":"IF(AZ9=\"\",\"\",IF(MainSheet!D16=\"Scratched\",\"\",BC9+BE9+BG9+BL9+BO9+BR9+BU9+BY9+CB9+CE9+CH9+CL9+CP9+CT9+CX9+DB9+DH9+DL9+DR9+DV9+EB9+EF9))","v":48},{"$error":"#N/A"},{"$error":"#N/A"}]
[{"$f":"IF(RaceLists!A10=\"\",\"\",IF(RaceLists!A10=\"END\",\"END\",IF(RaceLists!E10=\"\",\"\",getAddress(RaceLists!E10))))","v":"http://formguide.cyberhorse.com.au/index.php/Form/form.html?formdate=2010-11-24&track=Bunbry&raceno=8"},{"$nulls":11},{"$f":"IF(Meetings!B10=\"\",\"\",LEFT(Meetings!B10,FIND(\"(\",Meetings!B10)-2))","v":"LINGFIELD"},"LINGFIELD",{"$f":"IF(Meetings!D10=\"\",\"\",getAddress(Meetings!D10))","v":"http://www.tabonline.com.au/2010/11/24/ES01.html"},{"$f":"IF(Meetings!E10=\"\",\"\",getAddress(Meetings!E10))","v":"http://www.tabonline.com.au/2010/11/24/ES02.html"},{"$f":"IF(Meetings!F10=\"\",\"\",getAddress(Meetings!F10))","v":"http://www.tabonline.com.au/2010/11/24/ES03.html"},{"$f":"IF(Meetings!G10=\"\",\"\",getAddress(Meetings!G10))","v":"http://www.tabonline.com.au/2010/11/24/ES04.html"},{"$f":"IF(Meetings!H10=\"\",\"\",getAddress(Meetings!H10))","v":"http://www.tabonline.com.au/2010/11/24/ES05.html"},{"$f":"IF(Meetings!I10=\"\",\"\",getAddress(Meetings!I10))","v":"http://www.tabonline.com.au/2010/11/24/ES06.html"},{"$f":"IF(Meetings!J10=\"\",\"\",getAddress(Meetings!J10))","v":""},{"$f":"IF(Meetings!K10=\"\",\"\",getAddress(Meetings!K10))","v":""},{"$f":"IF(Meetings!L10=\"\",\"\",getAddress(Meetings!L10))","v":""},{"$f":"IF(Meetings!M10=\"\",\"\",getAddress(Meetings!M10))","v":""},{"$f":"IF(Meetings!N10=\"\",\"\",getAddress(Meetings!N10))","v":""},"",6,{"$nulls":24},{"$f":"IF(Form!I13<>\"\",LEFT(Form!C13,FIND(\"(\",Form!C13)-2),\"\")","v":"Coco Loco"},null,{"$f":"IF(AZ10=\"\",\"\",Form!A13)","v":9},{"$f":"IF($AZ10=\"\",\"\",IF(ISNA(VLOOKUP(BB10,Tables!A$5:B$100,2,FALSE)),\"0\",VLOOKUP(BB10,Tables!A$5:B$100,2,FALSE)))","v":2},{"$f":"IF($AZ10=\"\",\"\",VLOOKUP(AZ10,Race!$C$1:$N$100,7,FALSE))","v":7},{"$f":"IF($AZ10=\"\",\"\",IF(ISNA(VLOOKUP(BD10,Tables!C$5:D$100,2,FALSE)),\"0\",VLOOKUP(BD10,Tables!C$5:D$100,2,FALSE)))","v":2},{"$f":"IF(AZ10=\"\",\"\",Form!F13)","v":55},{"$f":"IF($AZ10=\"\",\"\",IF(ISNA(VLOOKUP(BF10,Tables!E$5:F$100,2,FALSE)),\"0\",VLOOKUP(BF10,Tables!E$5:F$100,2,FALSE)))","v":3}," Cd 56.5-0.0"," Cd 56.5",-1.5,"56.5",{"$f":"IF($AZ10=\"\",\"\",IF(ISERROR(BK10),0,IF(ISNA(VLOOKUP(BJ10,Tables!G$5:H$100,2,FALSE)),\"0\",VLOOKUP(BJ10,Tables!G13:H$100,2,FALSE))))","v":3},{"$f":"IF($AZ10=\"\",\"\",Form!G13)","v":0.7},5,{"$f":"IF($AZ10=\"\",\"\",IF(ISNA(VLOOKUP(BN10,Tables!I$5:J$100,2,FALSE)),\"0\",VLOOKUP(BN10,Tables!I$5:J$100,2,FALSE)))","v":3},{"$f":"IF($AZ10=\"\",\"\",Form!H13)","v":0},1,{"$f":"IF($AZ10=\"\",\"\",IF(ISNA(VLOOKUP(BQ10,Tables!K$5:L$100,2,FALSE)),\"0\",VLOOKUP(BQ10,Tables!K$5:L$100,2,FALSE)))","v":8},{"$f":"IF($AZ10=\"\",\"\",Form!I13)","v":29.4},6,{"$f":"IF($AZ10=\"\",\"\",IF(ISNA(VLOOKUP(BT10,Tables!M$5:N$100,2,FALSE)),\"0\",VLOOKUP(BT10,Tables!M$5:N$100,2,FALSE)))","v":2},{"$f":"IF($AZ10=\"\",\"\",INDEX(Race!$D$1:$P$100,MATCH($AZ10,Race!$C$1:$C$100,0)+0,9))","v":0},"","N",{"$f":"IF($AZ10=\"\",\"\",IF(ISNA(VLOOKUP(BX10,Tables!O$5:P$100,2,FALSE)),0,VLOOKUP(BX10,Tables!O$5:P$100,2,FALSE)))","v":0},"","N",{"$f":"IF($AZ10=\"\",\"\",IF(ISNA(VLOOKUP(CA10,Tables!Q$5:R$100,2,FALSE)),0,VLOOKUP(CA10,Tables!Q$5:R$100,2,FALSE)))","v":0},"","N",{"$f":"IF($AZ10=\"\",\"\",IF(ISNA(VLOOKUP(CD10,Tables!S$5:T$100,2,FALSE)),0,VLOOKUP(CD10,Tables!S$5:T$100,2,FALSE)))","v":0},"","N",{"$f":"IF($AZ10=\"\",\"\",IF(ISNA(VLOOKUP(CG10,Tables!U$5:V$100,2,FALSE)),0,VLOOKUP(CG10,Tables!U$5:V$100,2,FALSE)))","v":0},"2010-07-31",116,0,{"$f":"IF($AZ10=\"\",\"\",IF(ISERROR(CK10),0,IF(ISNA(VLOOKUP(CK10,Tables!W$5:X$100,2,FALSE)),\"0\",VLOOKUP(CK10,Tables!W$5:X$100,2,FALSE))))","v":0},"2010-07-17",130,0,{"$f":"IF($AZ10=\"\",\"\",IF(ISERROR(CO10),0,IF(ISNA(VLOOKUP(CO10,Tables!Y$5:Z$100,2,FALSE)),\"0\",VLOOKUP(CO10,Tables!Y$5:Z$100,2,FALSE))))","v":0},"2010-07-03",144,0,{"$f":"IF($AZ10=\"\",\"\",IF(ISERROR(CS10),0,IF(ISNA(VLOOKUP(CS10,Tables!AA$5:AB$100,2,FALSE)),\"0\",VLOOKUP(CS10,Tables!AA$5:AB$100,2,FALSE))))","v":0},14000,{"$f":"IF(CU10=\"\",\"\",(Form!$H$3-CU10)/CU10*100)","v":-28.571428571428569},2,{"$f":"IF($AZ10=\"\",\"\",IF(ISERROR(CW10),0,IF(ISNA(VLOOKUP(CW10,Tables!AC$5:AD$100,2,FALSE)),\"0\",VLOOKUP(CW10,Tables!AC$5:AD$100,2,FALSE))))","v":10},"3-8 4.6L","3",3,{"$f":"IF($AZ10=\"\",\"\",IF(ISERROR(DA10),0,IF(ISNA(VLOOKUP(DA10,Tables!AE$5:AF$100,2,FALSE)),\"0\",VLOOKUP(DA10,Tables!AE$5:AF$100,2,FALSE))))","v":3},"4.6L","4.6",4.5,4.5,4.5,{"$f":"IF($AZ10=\"\",\"\",IF(ISERROR(DG10),0,IF(ISNA(VLOOKUP(DF10,Tables!AG$5:AH$100,2,FALSE)),\"0\",VLOOKUP(DF10,Tables!AG$5:AH$100,2,FALSE))))","v":2},"2-14 0.2L","2",2,{"$f":"IF($AZ10=\"\",\"\",IF(ISERROR(DK10),0,IF(ISNA(VLOOKUP(DK10,Tables!AI$5:AJ$100,2,FALSE)),\"0\",VLOOKUP(DK10,Tables!AI$5:AJ$100,2,FALSE))))","v":5},"0.2L","0.2",0,0,0,{"$f":"IF($AZ10=\"\",\"\",IF(ISERROR(DQ10),0,IF(ISNA(VLOOKUP(DP10,Tables!AK$5:AL$100,2,FALSE)),\"0\",VLOOKUP(DP10,Tables!AK$5:AL$100,2,FALSE))))","v":5},"4-14 3.5L","4",4,{"$f":"IF($AZ10=\"\",\"\",IF(ISERROR(DU10),0,IF(ISNA(VLOOKUP(DU10,Tables!AM$5:AN$100,2,FALSE)),\"0\",VLOOKUP(DU10,Tables!AM$5:AN$100,2,FALSE))))","v":2},"3.5L","3.5",3.5,3.5,3.5,{"$f":"IF($BB10=\"\",\"\",IF(ISERROR(EA10),0,IF(ISNA(VLOOKUP(DZ10,Tables!AO$5:AP$100,2,FALSE)),\"0\",VLOOKUP(DZ10,Tables!AO$5:AP$100,2,FALSE))))","v":2},{"$f":"IF(AZ10=\"\",\"\",VLOOKUP(AZ10,Race!$C$1:$N$100,12,FALSE))","v":88},"88",88,{"$f":"IF($BB10=\"\",\"\",IF(ISNA(VLOOKUP(EE10,Tables!AQ$5:AR$100,2,FALSE)),\"0\",VLOOKUP(EE10,Tables!AQ$5:AR$100,2,FALSE)))","v":0},{"$f":"IF(AZ10=\"\",\"\",IF(MainSheet!D17=\"Scratched\",\"\",BC10+BE10+BG10+BL10+BO10+BR10+BU10+BY10+CB10+CE10+CH10+CL10+CP10+CT10+CX10+DB10+DH10+DL10+DR10+DV10+EB10+EF10))","v":52},{"$error":"#N/A"},{"$error":"#N/A"}]
[{"$f":"IF(RaceLists!A11=\"\",\"\",IF(RaceLists!A11=\"END\",\"END\",IF(RaceLists!E11=\"\",\"\",getAddress(RaceLists!E11))))","v":""},{"$nulls":11},{"$f":"IF(Meetings!B11=\"\",\"\",LEFT(Meetings!B11,FIND(\"(\",Meetings!B11)-2))","v":"HAPPY VALLEY"},"HAPPY",{"$f":"IF(Meetings!D11=\"\",\"\",getAddress(Meetings!D11))","v":"http://www.tabonline.com.au/2010/11/24/OS01.html"},{"$f":"IF(Meetings!E11=\"\",\"\",getAddress(Meetings!E11))","v":"http://www.tabonline.com.au/2010/11/24/OS02.html"},{"$f":"IF(Meetings!F11=\"\",\"\",getAddress(Meetings!F11))","v":"http://www.tabonline.com.au/2010/11/24/OS03.html"},{"$f":"IF(Meetings!G11=\"\",\"\",getAddress(Meetings!G11))","v":"http://www.tabonline.com.au/2010/11/24/OS04.html"},{"$f":"IF(Meetings!H11=\"\",\"\",getAddress(Meetings!H11))","v":"http://www.tabonline.com.au/2010/11/24/OS05.html"},{"$f":"IF(Meetings!I11=\"\",\"\",getAddress(Meetings!I11))","v":"http://www.tabonline.com.au/2010/11/24/OS06.html"},{"$f":"IF(Meetings!J11=\"\",\"\",getAddress(Meetings!J11))","v":"http://www.tabonline.com.au/2010/11/24/OS07.html"},{"$f":"IF(Meetings!K11=\"\",\"\",getAddress(Meetings!K11))","v":"http://www.tabonline.com.au/2010/11/24/OS08.html"},{"$f":"IF(Meetings!L11=\"\",\"\",getAddress(Meetings!L11))","v":""},{"$f":"IF(Meetings!M11=\"\",\"\",getAddress(Meetings!M11))","v":""},{"$f":"IF(Meetings!N11=\"\",\"\",getAddress(Meetings!N11))","v":""},"",7,{"$nulls":24},{"$f":"IF(Form!I14<>\"\",LEFT(Form!C14,FIND(\"(\",Form!C14)-2),\"\")","v":"Often Away"},null,{"$f":"IF(AZ11=\"\",\"\",Form!A14)","v":10},{"$f":"IF($AZ11=\"\",\"\",IF(ISNA(VLOOKUP(BB11,Tables!A$5:B$100,2,FALSE)),\"0\",VLOOKUP(BB11,Tables!A$5:B$100,2,FALSE)))","v":1},{"$f":"IF($AZ11=\"\",\"\",VLOOKUP(AZ11,Race!$C$1:$N$100,7,FALSE))","v":0},{"$f":"IF($AZ11=\"\",\"\",IF(ISNA(VLOOKUP(BD11,Tables!C$5:D$100,2,FALSE)),\"0\",VLOOKUP(BD11,Tables!C$5:D$100,2,FALSE)))","v":0},{"$f":"IF(AZ11=\"\",\"\",Form!F14)","v":55},{"$f":"IF($AZ11=\"\",\"\",IF(ISNA(VLOOKUP(BF11,Tables!E$5:F$100,2,FALSE)),\"0\",VLOOKUP(BF11,Tables!E$5:F$100,2,FALSE)))","v":3}," Cd 56.5-0.0"," Cd 56.5",-1.5,"56.5",{"$f":"IF($AZ11=\"\",\"\",IF(ISERROR(BK11),0,IF(ISNA(VLOOKUP(BJ11,Tables!G$5:H$100,2,FALSE)),\"0\",VLOOKUP(BJ11,Tables!G14:H$100,2,FALSE))))","v":3},{"$f":"IF($AZ11=\"\",\"\",Form!G14)","v":1.1000000000000001},2,{"$f":"IF($AZ11=\"\",\"\",IF(ISNA(VLOOKUP(BN11,Tables!I$5:J$100,2,FALSE)),\"0\",VLOOKUP(BN11,Tables!I$5:J$100,2,FALSE)))","v":6},{"$f":"IF($AZ11=\"\",\"\",Form!H14)","v":0},1,{"$f":"IF($AZ11=\"\",\"\",IF(ISNA(VLOOKUP(BQ11,Tables!K$5:L$100,2,FALSE)),\"0\",VLOOKUP(BQ11,Tables!K$5:L$100,2,FALSE)))","v":8},{"$f":"IF($AZ11=\"\",\"\",Form!I14)","v":57.1},1,{"$f":"IF($AZ11=\"\",\"\",IF(ISNA(VLOOKUP(BT11,Tables!M$5:N$100,2,FALSE)),\"0\",VLOOKUP(BT11,Tables!M$5:N$100,2,FALSE)))","v":8},{"$f":"IF($AZ11=\"\",\"\",INDEX(Race!$D$1:$P$100,MATCH($AZ11,Race!$C$1:$C$100,0)+0,9))","v":0},"","N",{"$f":"IF($AZ11=\"\",\"\",IF(ISNA(VLOOKUP(BX11,Tables!O$5:P$100,2,FALSE)),0,VLOOKUP(BX11,Tables!O$5:P$100,2,FALSE)))","v":0},"","N",{"$f":"IF($AZ11=\"\",\"\",IF(ISNA(VLOOKUP(CA11,Tables!Q$5:R$100,2,FALSE)),0,VLOOKUP(CA11,Tables!Q$5:R$100,2,FALSE)))","v":0},"","N",{"$f":"IF($AZ11=\"\",\"\",IF(ISNA(VLOOKUP(CD11,Tables!S$5:T$100,2,FALSE)),0,VLOOKUP(CD11,Tables!S$5:T$100,2,FALSE)))","v":0},"","N",{"$f":"IF($AZ11=\"\",\"\",IF(ISNA(VLOOKUP(CG11,Tables!U$5:V$100,2,FALSE)),0,VLOOKUP(CG11,Tables!U$5:V$100,2,FALSE)))","v":0},"2010-11-17",7,7,{"$f":"IF($AZ11=\"\",\"\",IF(ISERROR(CK11),0,IF(ISNA(VLOOKUP(CK11,Tables!W$5:X$100,2,FALSE)),\"0\",VLOOKUP(CK11,Tables!W$5:X$100,2,FALSE))))","v":5},"2010-11-04",20,20,{"$f":"IF($AZ11=\"\",\"\",IF(ISERROR(CO11),0,IF(ISNA(VLOOKUP(CO11,Tables!Y$5:Z$100,2,FALSE)),\"0\",VLOOKUP(CO11,Tables!Y$5:Z$100,2,FALSE))))","v":3},"2010-10-20",35,35,{"$f":"IF($AZ11=\"\",\"\",IF(ISERROR(CS11),0,IF(ISNA(VLOOKUP(CS11,Tables!AA$5:AB$100,2,FALSE)),\"0\",VLOOKUP(CS11,Tables!AA$5:AB$100,2,FALSE))))","v":2},10000,{"$f":"IF(CU11=\"\",\"\",(Form!$H$3-CU11)/CU11*100)","v":0},3,{"$f":"IF($AZ11=\"\",\"\",IF(ISERROR(CW11),0,IF(ISNA(VLOOKUP(CW11,Tables!AC$5:AD$100,2,FALSE)),\"0\",VLOOKUP(CW11,Tables!AC$5:AD$100,2,FALSE))))","v":0},"2-13 0.1L","2",2,{"$f":"IF($AZ11=\"\",\"\",IF(ISERROR(DA11),0,IF(ISNA(VLOOKUP(DA11,Tables!AE$5:AF$100,2,FALSE)),\"0\",VLOOKUP(DA11,Tables!AE$5:AF$100,2,FALSE))))","v":5},"0.1L","0.1",0,0,0,{"$f":"IF($AZ11=\"\",\"\",IF(ISERROR(DG11),0,IF(ISNA(VLOOKUP(DF11,Tables!AG$5:AH$100,2,FALSE)),\"0\",VLOOKUP(DF11,Tables!AG$5:AH$100,2,FALSE))))","v":5},"2-10 0.1L","2",2,{"$f":"IF($AZ11=\"\",\"\",IF(ISERROR(DK11),0,IF(ISNA(VLOOKUP(DK11,Tables!AI$5:AJ$100,2,FALSE)),\"0\",VLOOKUP(DK11,Tables!AI$5:AJ$100,2,FALSE))))","v":5},"0.1L","0.1",0,0,0,{"$f":"IF($AZ11=\"\",\"\",IF(ISERROR(DQ11),0,IF(ISNA(VLOOKUP(DP11,Tables!AK$5:AL$100,2,FALSE)),\"0\",VLOOKUP(DP11,Tables!AK$5:AL$100,2,FALSE))))","v":5},"4-10 4.6L","4",4,{"$f":"IF($AZ11=\"\",\"\",IF(ISERROR(DU11),0,IF(ISNA(VLOOKUP(DU11,Tables!AM$5:AN$100,2,FALSE)),\"0\",VLOOKUP(DU11,Tables!AM$5:AN$100,2,FALSE))))","v":2},"4.6L","4.6",4.5,4.5,4.5,{"$f":"IF($BB11=\"\",\"\",IF(ISERROR(EA11),0,IF(ISNA(VLOOKUP(DZ11,Tables!AO$5:AP$100,2,FALSE)),\"0\",VLOOKUP(DZ11,Tables!AO$5:AP$100,2,FALSE))))","v":2},{"$f":"IF(AZ11=\"\",\"\",VLOOKUP(AZ11,Race!$C$1:$N$100,12,FALSE))","v":0},"0",0,{"$f":"IF($BB11=\"\",\"\",IF(ISNA(VLOOKUP(EE11,Tables!AQ$5:AR$100,2,FALSE)),\"0\",VLOOKUP(EE11,Tables!AQ$5:AR$100,2,FALSE)))","v":0},{"$f":"IF(AZ11=\"\",\"\",IF(MainSheet!D18=\"Scratched\",\"\",BC11+BE11+BG11+BL11+BO11+BR11+BU11+BY11+CB11+CE11+CH11+CL11+CP11+CT11+CX11+DB11+DH11+DL11+DR11+DV11+EB11+EF11))","v":63},{"$error":"#N/A"},{"$error":"#N/A"}]
[{"$f":"IF(RaceLists!A12=\"\",\"\",IF(RaceLists!A12=\"END\",\"END\",IF(RaceLists!E12=\"\",\"\",getAddress(RaceLists!E12))))","v":"http://formguide.cyberhorse.com.au/index.php/Form/form.html?formdate=2010-11-24&track=D'Ben&raceno=1"},{"$nulls":11},{"$f":"IF(Meetings!B12=\"\",\"\",LEFT(Meetings!B12,FIND(\"(\",Meetings!B12)-2))","v":"TE AROHA"},"TE",{"$f":"IF(Meetings!D12=\"\",\"\",getAddress(Meetings!D12))","v":"http://www.tabonline.com.au/2010/11/24/ZS01.html"},{"$f":"IF(Meetings!E12=\"\",\"\",getAddress(Meetings!E12))","v":"http://www.tabonline.com.au/2010/11/24/ZS02.html"},{"$f":"IF(Meetings!F12=\"\",\"\",getAddress(Meetings!F12))","v":"http://www.tabonline.com.au/2010/11/24/ZS03.html"},{"$f":"IF(Meetings!G12=\"\",\"\",getAddress(Meetings!G12))","v":"http://www.tabonline.com.au/2010/11/24/ZS04.html"},{"$f":"IF(Meetings!H12=\"\",\"\",getAddress(Meetings!H12))","v":"http://www.tabonline.com.au/2010/11/24/ZS05.html"},{"$f":"IF(Meetings!I12=\"\",\"\",getAddress(Meetings!I12))","v":"http://www.tabonline.com.au/2010/11/24/ZS06.html"},{"$f":"IF(Meetings!J12=\"\",\"\",getAddress(Meetings!J12))","v":"http://www.tabonline.com.au/2010/11/24/ZS07.html"},{"$f":"IF(Meetings!K12=\"\",\"\",getAddress(Meetings!K12))","v":"http://www.tabonline.com.au/2010/11/24/ZS08.html"},{"$f":"IF(Meetings!L12=\"\",\"\",getAddress(Meetings!L12))","v":"http://www.tabonline.com.au/2010/11/24/ZS09.html"},{"$f":"IF(Meetings!M12=\"\",\"\",getAddress(Meetings!M12))","v":"http://www.tabonline.com.au/2010/11/24/ZS10.html"},{"$f":"IF(Meetings!N12=\"\",\"\",getAddress(Meetings!N12))","v":""},"",8,{"$nulls":24},{"$f":"IF(Form!I15<>\"\",LEFT(Form!C15,FIND(\"(\",Form!C15)-2),\"\")","v":"Promotional"},null,{"$f":"IF(AZ12=\"\",\"\",Form!A15)","v":11},{"$f":"IF($AZ12=\"\",\"\",IF(ISNA(VLOOKUP(BB12,Tables!A$5:B$100,2,FALSE)),\"0\",VLOOKUP(BB12,Tables!A$5:B$100,2,FALSE)))","v":1},{"$f":"IF($AZ12=\"\",\"\",VLOOKUP(AZ12,Race!$C$1:$N$100,7,FALSE))","v":8},{"$f":"IF($AZ12=\"\",\"\",IF(ISNA(VLOOKUP(BD12,Tables!C$5:D$100,2,FALSE)),\"0\",VLOOKUP(BD12,Tables!C$5:D$100,2,FALSE)))","v":2},{"$f":"IF(AZ12=\"\",\"\",Form!F15)","v":55},{"$f":"IF($AZ12=\"\",\"\",IF(ISNA(VLOOKUP(BF12,Tables!E$5:F$100,2,FALSE)),\"0\",VLOOKUP(BF12,Tables!E$5:F$100,2,FALSE)))","v":3}," Cd 56.5-0.0"," Cd 56.5",-1.5,"56.5",{"$f":"IF($AZ12=\"\",\"\",IF(ISERROR(BK12),0,IF(ISNA(VLOOKUP(BJ12,Tables!G$5:H$100,2,FALSE)),\"0\",VLOOKUP(BJ12,Tables!G15:H$100,2,FALSE))))","v":3},{"$f":"IF($AZ12=\"\",\"\",Form!G15)","v":0},16,{"$f":"IF($AZ12=\"\",\"\",IF(ISNA(VLOOKUP(BN12,Tables!I$5:J$100,2,FALSE)),\"0\",VLOOKUP(BN12,Tables!I$5:J$100,2,FALSE)))","v":0},{"$f":"IF($AZ12=\"\",\"\",Form!H15)","v":0},1,{"$f":"IF($AZ12=\"\",\"\",IF(ISNA(VLOOKUP(BQ12,Tables!K$5:L$100,2,FALSE)),\"0\",VLOOKUP(BQ12,Tables!K$5:L$100,2,FALSE)))","v":8},{"$f":"IF($AZ12=\"\",\"\",Form!I15)","v":0},11,{"$f":"IF($AZ12=\"\",\"\",IF(ISNA(VLOOKUP(BT12,Tables!M$5:N$100,2,FALSE)),\"0\",VLOOKUP(BT12,Tables!M$5:N$100,2,FALSE)))","v":2},{"$f":"IF($AZ12=\"\",\"\",INDEX(Race!$D$1:$P$100,MATCH($AZ12,Race!$C$1:$C$100,0)+0,9))","v":0},"","N",{"$f":"IF($AZ12=\"\",\"\",IF(ISNA(VLOOKUP(BX12,Tables!O$5:P$100,2,FALSE)),0,VLOOKUP(BX12,Tables!O$5:P$100,2,FALSE)))","v":0},"","N",{"$f":"IF($AZ12=\"\",\"\",IF(ISNA(VLOOKUP(CA12,Tables!Q$5:R$100,2,FALSE)),0,VLOOKUP(CA12,Tables!Q$5:R$100,2,FALSE)))","v":0},"","N",{"$f":"IF($AZ12=\"\",\"\",IF(ISNA(VLOOKUP(CD12,Tables!S$5:T$100,2,FALSE)),0,VLOOKUP(CD12,Tables!S$5:T$100,2,FALSE)))","v":0},"","N",{"$f":"IF($AZ12=\"\",\"\",IF(ISNA(VLOOKUP(CG12,Tables!U$5:V$100,2,FALSE)),0,VLOOKUP(CG12,Tables!U$5:V$100,2,FALSE)))","v":0},"2010-11-04",20,20,{"$f":"IF($AZ12=\"\",\"\",IF(ISERROR(CK12),0,IF(ISNA(VLOOKUP(CK12,Tables!W$5:X$100,2,FALSE)),\"0\",VLOOKUP(CK12,Tables!W$5:X$100,2,FALSE))))","v":2},"00:00:00",40506,0,{"$f":"IF($AZ12=\"\",\"\",IF(ISERROR(CO12),0,IF(ISNA(VLOOKUP(CO12,Tables!Y$5:Z$100,2,FALSE)),\"0\",VLOOKUP(CO12,Tables!Y$5:Z$100,2,FALSE))))","v":0},"00:00:00",40506,0,{"$f":"IF($AZ12=\"\",\"\",IF(ISERROR(CS12),0,IF(ISNA(VLOOKUP(CS12,Tables!AA$5:AB$100,2,FALSE)),\"0\",VLOOKUP(CS12,Tables!AA$5:AB$100,2,FALSE))))","v":0},10000,{"$f":"IF(CU12=\"\",\"\",(Form!$H$3-CU12)/CU12*100)","v":0},3,{"$f":"IF($AZ12=\"\",\"\",IF(ISERROR(CW12),0,IF(ISNA(VLOOKUP(CW12,Tables!AC$5:AD$100,2,FALSE)),\"0\",VLOOKUP(CW12,Tables!AC$5:AD$100,2,FALSE))))","v":0},"6-9 4.8L","6",6,{"$f":"IF($AZ12=\"\",\"\",IF(ISERROR(DA12),0,IF(ISNA(VLOOKUP(DA12,Tables!AE$5:AF$100,2,FALSE)),\"0\",VLOOKUP(DA12,Tables!AE$5:AF$100,2,FALSE))))","v":0},"4.8L","4.8",5,5,5,{"$f":"IF($AZ12=\"\",\"\",IF(ISERROR(DG12),0,IF(ISNA(VLOOKUP(DF12,Tables!AG$5:AH$100,2,FALSE)),\"0\",VLOOKUP(DF12,Tables!AG$5:AH$100,2,FALSE))))","v":2},"12 Red Savina (11) 55.0kg 4yo b m",{"$error":"#VALUE!"},{"$error":"#VALUE!"},{"$f":"IF($AZ12=\"\",\"\",IF(ISERROR(DK12),0,IF(ISNA(VLOOKUP(DK12,Tables!AI$5:AJ$100,2,FALSE)),\"0\",VLOOKUP(DK12,Tables!AI$5:AJ$100,2,FALSE))))","v":0}," m",{"$error":"#VALUE!"},{"$error":"#VALUE!"},{"$error":"#VALUE!"},{"$error":"#VALUE!"},{"$f":"IF($AZ12=\"\",\"\",IF(ISERROR(DQ12),0,IF(ISNA(VLOOKUP(DP12,Tables!AK$5:AL$100,2,FALSE)),\"0\",VLOOKUP(DP12,Tables!AK$5:AL$100,2,FALSE))))","v":0},"Colours: Royal blue",{"$error":"#VALUE!"},{"$error":"#VALUE!"},{"$f":"IF($AZ12=\"\",\"\",IF(ISERROR(DU12),0,IF(ISNA(VLOOKUP(DU12,Tables!AM$5:AN$100,2,FALSE)),\"0\",VLOOKUP(DU12,Tables!AM$5:AN$100,2,FALSE))))","v":0},"yal blue",{"$error":"#VALUE!"},{"$error":"#VALUE!"},{"$error":"#VALUE!"},{"$error":"#VALUE!"},{"$f":"IF($BB12=\"\",\"\",IF(ISERROR(EA12),0,IF(ISNA(VLOOKUP(DZ12,Tables!AO$5:AP$100,2,FALSE)),\"0\",VLOOKUP(DZ12,Tables!AO$5:AP$100,2,FALSE))))","v":0},{"$f":"IF(AZ12=\"\",\"\",VLOOKUP(AZ12,Race!$C$1:$N$100,12,FALSE))","v":88},"88",88,{"$f":"IF($BB12=\"\",\"\",IF(ISNA(VLOOKUP(EE12,Tables!AQ$5:AR$100,2,FALSE)),\"0\",VLOOKUP(EE12,Tables!AQ$5:AR$100,2,FALSE)))","v":0},{"$f":"IF(AZ12=\"\",\"\",IF(MainSheet!D19=\"Scratched\",\"\",BC12+BE12+BG12+BL12+BO12+BR12+BU12+BY12+CB12+CE12+CH12+CL12+CP12+CT12+CX12+DB12+DH12+DL12+DR12+DV12+EB12+EF12))","v":23},{"$error":"#N/A"},{"$error":"#N/A"}]
[{"$f":"IF(RaceLists!A13=\"\",\"\",IF(RaceLists!A13=\"END\",\"END\",IF(RaceLists!E13=\"\",\"\",getAddress(RaceLists!E13))))","v":"http://formguide.cyberhorse.com.au/index.php/Form/form.html?formdate=2010-11-24&track=D'Ben&raceno=2"},{"$nulls":11},{"$f":"IF(Meetings!B13=\"\",\"\",LEFT(Meetings!B13,FIND(\"(\",Meetings!B13)-2))","v":""},"",{"$f":"IF(Meetings!D13=\"\",\"\",getAddress(Meetings!D13))","v":{"$error":"#VALUE!"}},{"$f":"IF(Meetings!E13=\"\",\"\",getAddress(Meetings!E13))","v":{"$error":"#VALUE!"}},{"$f":"IF(Meetings!F13=\"\",\"\",getAddress(Meetings!F13))","v":{"$error":"#VALUE!"}},{"$f":"IF(Meetings!G13=\"\",\"\",getAddress(Meetings!G13))","v":{"$error":"#VALUE!"}},{"$f":"IF(Meetings!H13=\"\",\"\",getAddress(Meetings!H13))","v":{"$error":"#VALUE!"}},{"$f":"IF(Meetings!I13=\"\",\"\",getAddress(Meetings!I13))","v":{"$error":"#VALUE!"}},{"$f":"IF(Meetings!J13=\"\",\"\",getAddress(Meetings!J13))","v":{"$error":"#VALUE!"}},{"$f":"IF(Meetings!K13=\"\",\"\",getAddress(Meetings!K13))","v":{"$error":"#VALUE!"}},{"$f":"IF(Meetings!L13=\"\",\"\",getAddress(Meetings!L13))","v":{"$error":"#VALUE!"}},{"$f":"IF(Meetings!M13=\"\",\"\",getAddress(Meetings!M13))","v":{"$error":"#VALUE!"}},{"$f":"IF(Meetings!N13=\"\",\"\",getAddress(Meetings!N13))","v":{"$error":"#VALUE!"}},"",9,{"$nulls":24},{"$f":"IF(Form!I16<>\"\",LEFT(Form!C16,FIND(\"(\",Form!C16)-2),\"\")","v":"Red Savina"},null,{"$f":"IF(AZ13=\"\",\"\",Form!A16)","v":12},{"$f":"IF($AZ13=\"\",\"\",IF(ISNA(VLOOKUP(BB13,Tables!A$5:B$100,2,FALSE)),\"0\",VLOOKUP(BB13,Tables!A$5:B$100,2,FALSE)))","v":1},{"$f":"IF($AZ13=\"\",\"\",VLOOKUP(AZ13,Race!$C$1:$N$100,7,FALSE))","v":0},{"$f":"IF($AZ13=\"\",\"\",IF(ISNA(VLOOKUP(BD13,Tables!C$5:D$100,2,FALSE)),\"0\",VLOOKUP(BD13,Tables!C$5:D$100,2,FALSE)))","v":0},{"$f":"IF(AZ13=\"\",\"\",Form!F16)","v":55},{"$f":"IF($AZ13=\"\",\"\",IF(ISNA(VLOOKUP(BF13,Tables!E$5:F$100,2,FALSE)),\"0\",VLOOKUP(BF13,Tables!E$5:F$100,2,FALSE)))","v":3}," Cd 56.5-0.0"," Cd 56.5",-1.5,"56.5",{"$f":"IF($AZ13=\"\",\"\",IF(ISERROR(BK13),0,IF(ISNA(VLOOKUP(BJ13,Tables!G$5:H$100,2,FALSE)),\"0\",VLOOKUP(BJ13,Tables!G16:H$100,2,FALSE))))","v":3},{"$f":"IF($AZ13=\"\",\"\",Form!G16)","v":1.2},1,{"$f":"IF($AZ13=\"\",\"\",IF(ISNA(VLOOKUP(BN13,Tables!I$5:J$100,2,FALSE)),\"0\",VLOOKUP(BN13,Tables!I$5:J$100,2,FALSE)))","v":8},{"$f":"IF($AZ13=\"\",\"\",Form!H16)","v":0},1,{"$f":"IF($AZ13=\"\",\"\",IF(ISNA(VLOOKUP(BQ13,Tables!K$5:L$100,2,FALSE)),\"0\",VLOOKUP(BQ13,Tables!K$5:L$100,2,FALSE)))","v":8},{"$f":"IF($AZ13=\"\",\"\",Form!I16)","v":57.1},1,{"$f":"IF($AZ13=\"\",\"\",IF(ISNA(VLOOKUP(BT13,Tables!M$5:N$100,2,FALSE)),\"0\",VLOOKUP(BT13,Tables!M$5:N$100,2,FALSE)))","v":8},{"$f":"IF($AZ13=\"\",\"\",INDEX(Race!$D$1:$P$100,MATCH($AZ13,Race!$C$1:$C$100,0)+0,9))","v":0},"","N",{"$f":"IF($AZ13=\"\",\"\",IF(ISNA(VLOOKUP(BX13,Tables!O$5:P$100,2,FALSE)),0,VLOOKUP(BX13,Tables!O$5:P$100,2,FALSE)))","v":0},"","N",{"$f":"IF($AZ13=\"\",\"\",IF(ISNA(VLOOKUP(CA13,Tables!Q$5:R$100,2,FALSE)),0,VLOOKUP(CA13,Tables!Q$5:R$100,2,FALSE)))","v":0},"","N",{"$f":"IF($AZ13=\"\",\"\",IF(ISNA(VLOOKUP(CD13,Tables!S$5:T$100,2,FALSE)),0,VLOOKUP(CD13,Tables!S$5:T$100,2,FALSE)))","v":0},"","N",{"$f":"IF($AZ13=\"\",\"\",IF(ISNA(VLOOKUP(CG13,Tables!U$5:V$100,2,FALSE)),0,VLOOKUP(CG13,Tables!U$5:V$100,2,FALSE)))","v":0},"2010-11-04",20,20,{"$f":"IF($AZ13=\"\",\"\",IF(ISERROR(CK13),0,IF(ISNA(VLOOKUP(CK13,Tables!W$5:X$100,2,FALSE)),\"0\",VLOOKUP(CK13,Tables!W$5:X$100,2,FALSE))))","v":2},"2010-10-21",34,34,{"$f":"IF($AZ13=\"\",\"\",IF(ISERROR(CO13),0,IF(ISNA(VLOOKUP(CO13,Tables!Y$5:Z$100,2,FALSE)),\"0\",VLOOKUP(CO13,Tables!Y$5:Z$100,2,FALSE))))","v":0},"2010-10-06",49,49,{"$f":"IF($AZ13=\"\",\"\",IF(ISERROR(CS13),0,IF(ISNA(VLOOKUP(CS13,Tables!AA$5:AB$100,2,FALSE)),\"0\",VLOOKUP(CS13,Tables!AA$5:AB$100,2,FALSE))))","v":0},10000,{"$f":"IF(CU13=\"\",\"\",(Form!$H$3-CU13)/CU13*100)","v":0},3,{"$f":"IF($AZ13=\"\",\"\",IF(ISERROR(CW13),0,IF(ISNA(VLOOKUP(CW13,Tables!AC$5:AD$100,2,FALSE)),\"0\",VLOOKUP(CW13,Tables!AC$5:AD$100,2,FALSE))))","v":0},"6-10 4.1L","6",6,{"$f":"IF($AZ13=\"\",\"\",IF(ISERROR(DA13),0,IF(ISNA(VLOOKUP(DA13,Tables!AE$5:AF$100,2,FALSE)),\"0\",VLOOKUP(DA13,Tables!AE$5:AF$100,2,FALSE))))","v":0},"4.1L","4.1",4,4,4,{"$f":"IF($AZ13=\"\",\"\",IF(ISERROR(DG13),0,IF(ISNA(VLOOKUP(DF13,Tables!AG$5:AH$100,2,FALSE)),\"0\",VLOOKUP(DF13,Tables!AG$5:AH$100,2,FALSE))))","v":2},"2-14 0.8L","2",2,{"$f":"IF($AZ13=\"\",\"\",IF(ISERROR(DK13),0,IF(ISNA(VLOOKUP(DK13,Tables!AI$5:AJ$100,2,FALSE)),\"0\",VLOOKUP(DK13,Tables!AI$5:AJ$100,2,FALSE))))","v":5},"0.8L","0.8",1,1,1,{"$f":"IF($AZ13=\"\",\"\",IF(ISERROR(DQ13),0,IF(ISNA(VLOOKUP(DP13,Tables!AK$5:AL$100,2,FALSE)),\"0\",VLOOKUP(DP13,Tables!AK$5:AL$100,2,FALSE))))","v":7},"2-10 0.5L","2",2,{"$f":"IF($AZ13=\"\",\"\",IF(ISERROR(DU13),0,IF(ISNA(VLOOKUP(DU13,Tables!AM$5:AN$100,2,FALSE)),\"0\",VLOOKUP(DU13,Tables!AM$5:AN$100,2,FALSE))))","v":5},"0.5L","0.5",0.5,0.5,0.5,{"$f":"IF($BB13=\"\",\"\",IF(ISERROR(EA13),0,IF(ISNA(VLOOKUP(DZ13,Tables!AO$5:AP$100,2,FALSE)),\"0\",VLOOKUP(DZ13,Tables!AO$5:AP$100,2,FALSE))))","v":7},{"$f":"IF(AZ13=\"\",\"\",VLOOKUP(AZ13,Race!$C$1:$N$100,12,FALSE))","v":0},"0",0,{"$f":"IF($BB13=\"\",\"\",IF(ISNA(VLOOKUP(EE13,Tables!AQ$5:AR$100,2,FALSE)),\"0\",VLOOKUP(EE13,Tables!AQ$5:AR$100,2,FALSE)))","v":0},{"$f":"IF(AZ13=\"\",\"\",IF(MainSheet!D20=\"Scratched\",\"\",BC13+BE13+BG13+BL13+BO13+BR13+BU13+BY13+CB13+CE13+CH13+CL13+CP13+CT13+CX13+DB13+DH13+DL13+DR13+DV13+EB13+EF13))","v":59},{"$error":"#N/A"},{"$error":"#N/A"}]
[{"$f":"IF(RaceLists!A14=\"\",\"\",IF(RaceLists!A14=\"END\",\"END\",IF(RaceLists!E14=\"\",\"\",getAddress(RaceLists!E14))))","v":"http://formguide.cyberhorse.com.au/index.php/Form/form.html?formdate=2010-11-24&track=D'Ben&raceno=3"},{"$nulls":11},{"$f":"IF(Meetings!B14=\"\",\"\",LEFT(Meetings!B14,FIND(\"(\",Meetings!B14)-2))","v":"REDCLIFFE"},"REDCLIFFE",{"$f":"IF(Meetings!D14=\"\",\"\",getAddress(Meetings!D14))","v":"http://www.tabonline.com.au/2010/11/24/BT01.html"},{"$f":"IF(Meetings!E14=\"\",\"\",getAddress(Meetings!E14))","v":"http://www.tabonline.com.au/2010/11/24/BT02.html"},{"$f":"IF(Meetings!F14=\"\",\"\",getAddress(Meetings!F14))","v":"http://www.tabonline.com.au/2010/11/24/BT03.html"},{"$f":"IF(Meetings!G14=\"\",\"\",getAddress(Meetings!G14))","v":"http://www.tabonline.com.au/2010/11/24/BT04.html"},{"$f":"IF(Meetings!H14=\"\",\"\",getAddress(Meetings!H14))","v":"http://www.tabonline.com.au/2010/11/24/BT05.html"},{"$f":"IF(Meetings!I14=\"\",\"\",getAddress(Meetings!I14))","v":"http://www.tabonline.com.au/2010/11/24/BT06.html"},{"$f":"IF(Meetings!J14=\"\",\"\",getAddress(Meetings!J14))","v":"http://www.tabonline.com.au/2010/11/24/BT07.html"},{"$f":"IF(Meetings!K14=\"\",\"\",getAddress(Meetings!K14))","v":"http://www.tabonline.com.au/2010/11/24/BT08.html"},{"$f":"IF(Meetings!L14=\"\",\"\",getAddress(Meetings!L14))","v":""},{"$f":"IF(Meetings!M14=\"\",\"\",getAddress(Meetings!M14))","v":""},{"$f":"IF(Meetings!N14=\"\",\"\",getAddress(Meetings!N14))","v":""},"",10,{"$nulls":24},{"$f":"IF(Form!I17<>\"\",LEFT(Form!C17,FIND(\"(\",Form!C17)-2),\"\")","v":"September Rain"},null,{"$f":"IF(AZ14=\"\",\"\",Form!A17)","v":13},{"$f":"IF($AZ14=\"\",\"\",IF(ISNA(VLOOKUP(BB14,Tables!A$5:B$100,2,FALSE)),\"0\",VLOOKUP(BB14,Tables!A$5:B$100,2,FALSE)))","v":0},{"$f":"IF($AZ14=\"\",\"\",VLOOKUP(AZ14,Race!$C$1:$N$100,7,FALSE))","v":4},{"$f":"IF($AZ14=\"\",\"\",IF(ISNA(VLOOKUP(BD14,Tables!C$5:D$100,2,FALSE)),\"0\",VLOOKUP(BD14,Tables!C$5:D$100,2,FALSE)))","v":3},{"$f":"IF(AZ14=\"\",\"\",Form!F17)","v":53.5},{"$f":"IF($AZ14=\"\",\"\",IF(ISNA(VLOOKUP(BF14,Tables!E$5:F$100,2,FALSE)),\"0\",VLOOKUP(BF14,Tables!E$5:F$100,2,FALSE)))","v":2}," Cd 55.0-0.0"," Cd 55.0",-1.5,"55.0",{"$f":"IF($AZ14=\"\",\"\",IF(ISERROR(BK14),0,IF(ISNA(VLOOKUP(BJ14,Tables!G$5:H$100,2,FALSE)),\"0\",VLOOKUP(BJ14,Tables!G17:H$100,2,FALSE))))","v":3},{"$f":"IF($AZ14=\"\",\"\",Form!G17)","v":0.3},9,{"$f":"IF($AZ14=\"\",\"\",IF(ISNA(VLOOKUP(BN14,Tables!I$5:J$100,2,FALSE)),\"0\",VLOOKUP(BN14,Tables!I$5:J$100,2,FALSE)))","v":2},{"$f":"IF($AZ14=\"\",\"\",Form!H17)","v":0},1,{"$f":"IF($AZ14=\"\",\"\",IF(ISNA(VLOOKUP(BQ14,Tables!K$5:L$100,2,FALSE)),\"0\",VLOOKUP(BQ14,Tables!K$5:L$100,2,FALSE)))","v":8},{"$f":"IF($AZ14=\"\",\"\",Form!I17)","v":0},11,{"$f":"IF($AZ14=\"\",\"\",IF(ISNA(VLOOKUP(BT14,Tables!M$5:N$100,2,FALSE)),\"0\",VLOOKUP(BT14,Tables!M$5:N$100,2,FALSE)))","v":2},{"$f":"IF($AZ14=\"\",\"\",INDEX(Race!$D$1:$P$100,MATCH($AZ14,Race!$C$1:$C$100,0)+0,9))","v":0},"","N",{"$f":"IF($AZ14=\"\",\"\",IF(ISNA(VLOOKUP(BX14,Tables!O$5:P$100,2,FALSE)),0,VLOOKUP(BX14,Tables!O$5:P$100,2,FALSE)))","v":0},"","N",{"$f":"IF($AZ14=\"\",\"\",IF(ISNA(VLOOKUP(CA14,Tables!Q$5:R$100,2,FALSE)),0,VLOOKUP(CA14,Tables!Q$5:R$100,2,FALSE)))","v":0},"","N",{"$f":"IF($AZ14=\"\",\"\",IF(ISNA(VLOOKUP(CD14,Tables!S$5:T$100,2,FALSE)),0,VLOOKUP(CD14,Tables!S$5:T$100,2,FALSE)))","v":0},"","N",{"$f":"IF($AZ14=\"\",\"\",IF(ISNA(VLOOKUP(CG14,Tables!U$5:V$100,2,FALSE)),0,VLOOKUP(CG14,Tables!U$5:V$100,2,FALSE)))","v":0},"2010-11-04",20,20,{"$f":"IF($AZ14=\"\",\"\",IF(ISERROR(CK14),0,IF(ISNA(VLOOKUP(CK14,Tables!W$5:X$100,2,FALSE)),\"0\",VLOOKUP(CK14,Tables!W$5:X$100,2,FALSE))))","v":2},"2010-10-04",51,51,{"$f":"IF($AZ14=\"\",\"\",IF(ISERROR(CO14),0,IF(ISNA(VLOOKUP(CO14,Tables!Y$5:Z$100,2,FALSE)),\"0\",VLOOKUP(CO14,Tables!Y$5:Z$100,2,FALSE))))","v":0},"00:00:00",40506,0,{"$f":"IF($AZ14=\"\",\"\",IF(ISERROR(CS14),0,IF(ISNA(VLOOKUP(CS14,Tables!AA$5:AB$100,2,FALSE)),\"0\",VLOOKUP(CS14,Tables!AA$5:AB$100,2,FALSE))))","v":0},10000,{"$f":"IF(CU14=\"\",\"\",(Form!$H$3-CU14)/CU14*100)","v":0},3,{"$f":"IF($AZ14=\"\",\"\",IF(ISERROR(CW14),0,IF(ISNA(VLOOKUP(CW14,Tables!AC$5:AD$100,2,FALSE)),\"0\",VLOOKUP(CW14,Tables!AC$5:AD$100,2,FALSE))))","v":0},"4-9 3.9L","4",4,{"$f":"IF($AZ14=\"\",\"\",IF(ISERROR(DA14),0,IF(ISNA(VLOOKUP(DA14,Tables!AE$5:AF$100,2,FALSE)),\"0\",VLOOKUP(DA14,Tables!AE$5:AF$100,2,FALSE))))","v":2},"3.9L","3.9",4,4,4,{"$f":"IF($AZ14=\"\",\"\",IF(ISERROR(DG14),0,IF(ISNA(VLOOKUP(DF14,Tables!AG$5:AH$100,2,FALSE)),\"0\",VLOOKUP(DF14,Tables!AG$5:AH$100,2,FALSE))))","v":2},"6-8 7.3L","6",6,{"$f":"IF($AZ14=\"\",\"\",IF(ISERROR(DK14),0,IF(ISNA(VLOOKUP(DK14,Tables!AI$5:AJ$100,2,FALSE)),\"0\",VLOOKUP(DK14,Tables!AI$5:AJ$100,2,FALSE))))","v":0},".3L",".3",0.5,0.5,0.5,{"$f":"IF($AZ14=\"\",\"\",IF(ISERROR(DQ14),0,IF(ISNA(VLOOKUP(DP14,Tables!AK$5:AL$100,2,FALSE)),\"0\",VLOOKUP(DP14,Tables!AK$5:AL$100,2,FALSE))))","v":7},"14 Twilight Dancer (10) 53.5kg 3yo ch f",{"$error":"#VALUE!"},{"$error":"#VALUE!"},{"$f":"IF($AZ14=\"\",\"\",IF(ISERROR(DU14),0,IF(ISNA(VLOOKUP(DU14,Tables!AM$5:AN$100,2,FALSE)),\"0\",VLOOKUP(DU14,Tables!AM$5:AN$100,2,FALSE))))","v":0}," f",{"$error":"#VALUE!"},{"$error":"#VALUE!"},{"$error":"#VALUE!"},{"$error":"#VALUE!"},{"$f":"IF($BB14=\"\",\"\",IF(ISERROR(EA14),0,IF(ISNA(VLOOKUP(DZ14,Tables!AO$5:AP$100,2,FALSE)),\"0\",VLOOKUP(DZ14,Tables!AO$5:AP$100,2,FALSE))))","v":0},{"$f":"IF(AZ14=\"\",\"\",VLOOKUP(AZ14,Race!$C$1:$N$100,12,FALSE))","v":89},"89",89,{"$f":"IF($BB14=\"\",\"\",IF(ISNA(VLOOKUP(EE14,Tables!AQ$5:AR$100,2,FALSE)),\"0\",VLOOKUP(EE14,Tables!AQ$5:AR$100,2,FALSE)))","v":0},{"$f":"IF(AZ14=\"\",\"\",IF(MainSheet!D21=\"Scratched\",\"\",BC14+BE14+BG14+BL14+BO14+BR14+BU14+BY14+CB14+CE14+CH14+CL14+CP14+CT14+CX14+DB14+DH14+DL14+DR14+DV14+EB14+EF14))","v":33},{"$error":"#N/A"},{"$error":"#N/A"}]
[{"$f":"IF(RaceLists!A15=\"\",\"\",IF(RaceLists!A15=\"END\",\"END\",IF(RaceLists!E15=\"\",\"\",getAddress(RaceLists!E15))))","v":"http://formguide.cyberhorse.com.au/index.php/Form/form.html?formdate=2010-11-24&track=D'Ben&raceno=4"},{"$nulls":11},{"$f":"IF(Meetings!B15=\"\",\"\",LEFT(Meetings!B15,FIND(\"(\",Meetings!B15)-2))","v":"DUBBO"},"DUBBO",{"$f":"IF(Meetings!D15=\"\",\"\",getAddress(Meetings!D15))","v":"http://www.tabonline.com.au/2010/11/24/ST01.html"},{"$f":"IF(Meetings!E15=\"\",\"\",getAddress(Meetings!E15))","v":"http://www.tabonline.com.au/2010/11/24/ST02.html"},{"$f":"IF(Meetings!F15=\"\",\"\",getAddress(Meetings!F15))","v":"http://www.tabonline.com.au/2010/11/24/ST03.html"},{"$f":"IF(Meetings!G15=\"\",\"\",getAddress(Meetings!G15))","v":"http://www.tabonline.com.au/2010/11/24/ST04.html"},{"$f":"IF(Meetings!H15=\"\",\"\",getAddress(Meetings!H15))","v":"http://www.tabonline.com.au/2010/11/24/ST05.html"},{"$f":"IF(Meetings!I15=\"\",\"\",getAddress(Meetings!I15))","v":"http://www.tabonline.com.au/2010/11/24/ST06.html"},{"$f":"IF(Meetings!J15=\"\",\"\",getAddress(Meetings!J15))","v":"http://www.tabonline.com.au/2010/11/24/ST07.html"},{"$f":"IF(Meetings!K15=\"\",\"\",getAddress(Meetings!K15))","v":"http://www.tabonline.com.au/2010/11/24/ST08.html"},{"$f":"IF(Meetings!L15=\"\",\"\",getAddress(Meetings!L15))","v":""},{"$f":"IF(Meetings!M15=\"\",\"\",getAddress(Meetings!M15))","v":""},{"$f":"IF(Meetings!N15=\"\",\"\",getAddress(Meetings!N15))","v":""},"",11,{"$nulls":24},{"$f":"IF(Form!I18<>\"\",LEFT(Form!C18,FIND(\"(\",Form!C18)-2),\"\")","v":"Twilight Dancer"},null,{"$f":"IF(AZ15=\"\",\"\",Form!A18)","v":14},{"$f":"IF($AZ15=\"\",\"\",IF(ISNA(VLOOKUP(BB15,Tables!A$5:B$100,2,FALSE)),\"0\",VLOOKUP(BB15,Tables!A$5:B$100,2,FALSE)))","v":0},{"$f":"IF($AZ15=\"\",\"\",VLOOKUP(AZ15,Race!$C$1:$N$100,7,FALSE))","v":10},{"$f":"IF($AZ15=\"\",\"\",IF(ISNA(VLOOKUP(BD15,Tables!C$5:D$100,2,FALSE)),\"0\",VLOOKUP(BD15,Tables!C$5:D$100,2,FALSE)))","v":1},{"$f":"IF(AZ15=\"\",\"\",Form!F18)","v":53.5},{"$f":"IF($AZ15=\"\",\"\",IF(ISNA(VLOOKUP(BF15,Tables!E$5:F$100,2,FALSE)),\"0\",VLOOKUP(BF15,Tables!E$5:F$100,2,FALSE)))","v":2}," Cd 55.0--1.5"," Cd 55.0",-1.5,"55.0",{"$f":"IF($AZ15=\"\",\"\",IF(ISERROR(BK15),0,IF(ISNA(VLOOKUP(BJ15,Tables!G$5:H$100,2,FALSE)),\"0\",VLOOKUP(BJ15,Tables!G18:H$100,2,FALSE))))","v":3},{"$f":"IF($AZ15=\"\",\"\",Form!G18)","v":1.1000000000000001},2,{"$f":"IF($AZ15=\"\",\"\",IF(ISNA(VLOOKUP(BN15,Tables!I$5:J$100,2,FALSE)),\"0\",VLOOKUP(BN15,Tables!I$5:J$100,2,FALSE)))","v":6},{"$f":"IF($AZ15=\"\",\"\",Form!H18)","v":0},1,{"$f":"IF($AZ15=\"\",\"\",IF(ISNA(VLOOKUP(BQ15,Tables!K$5:L$100,2,FALSE)),\"0\",VLOOKUP(BQ15,Tables!K$5:L$100,2,FALSE)))","v":8},{"$f":"IF($AZ15=\"\",\"\",Form!I18)","v":25},7,{"$f":"IF($AZ15=\"\",\"\",IF(ISNA(VLOOKUP(BT15,Tables!M$5:N$100,2,FALSE)),\"0\",VLOOKUP(BT15,Tables!M$5:N$100,2,FALSE)))","v":2},{"$f":"IF($AZ15=\"\",\"\",INDEX(Race!$D$1:$P$100,MATCH($AZ15,Race!$C$1:$C$100,0)+0,9))","v":0},"","N",{"$f":"IF($AZ15=\"\",\"\",IF(ISNA(VLOOKUP(BX15,Tables!O$5:P$100,2,FALSE)),0,VLOOKUP(BX15,Tables!O$5:P$100,2,FALSE)))","v":0},"","N",{"$f":"IF($AZ15=\"\",\"\",IF(ISNA(VLOOKUP(CA15,Tables!Q$5:R$100,2,FALSE)),0,VLOOKUP(CA15,Tables!Q$5:R$100,2,FALSE)))","v":0},"","N",{"$f":"IF($AZ15=\"\",\"\",IF(ISNA(VLOOKUP(CD15,Tables!S$5:T$100,2,FALSE)),0,VLOOKUP(CD15,Tables!S$5:T$100,2,FALSE)))","v":0},"","N",{"$f":"IF($AZ15=\"\",\"\",IF(ISNA(VLOOKUP(CG15,Tables!U$5:V$100,2,FALSE)),0,VLOOKUP(CG15,Tables!U$5:V$100,2,FALSE)))","v":0},"2010-11-02",22,22,{"$f":"IF($AZ15=\"\",\"\",IF(ISERROR(CK15),0,IF(ISNA(VLOOKUP(CK15,Tables!W$5:X$100,2,FALSE)),\"0\",VLOOKUP(CK15,Tables!W$5:X$100,2,FALSE))))","v":0},"2010-10-06",49,49,{"$f":"IF($AZ15=\"\",\"\",IF(ISERROR(CO15),0,IF(ISNA(VLOOKUP(CO15,Tables!Y$5:Z$100,2,FALSE)),\"0\",VLOOKUP(CO15,Tables!Y$5:Z$100,2,FALSE))))","v":0},"2010-05-08",200,0,{"$f":"IF($AZ15=\"\",\"\",IF(ISERROR(CS15),0,IF(ISNA(VLOOKUP(CS15,Tables!AA$5:AB$100,2,FALSE)),\"0\",VLOOKUP(CS15,Tables!AA$5:AB$100,2,FALSE))))","v":0},10000,{"$f":"IF(CU15=\"\",\"\",(Form!$H$3-CU15)/CU15*100)","v":0},3,{"$f":"IF($AZ15=\"\",\"\",IF(ISERROR(CW15),0,IF(ISNA(VLOOKUP(CW15,Tables!AC$5:AD$100,2,FALSE)),\"0\",VLOOKUP(CW15,Tables!AC$5:AD$100,2,FALSE))))","v":0},"5-13 3.8L","5",5,{"$f":"IF($AZ15=\"\",\"\",IF(ISERROR(DA15),0,IF(ISNA(VLOOKUP(DA15,Tables!AE$5:AF$100,2,FALSE)),\"0\",VLOOKUP(DA15,Tables!AE$5:AF$100,2,FALSE))))","v":2},"3.8L","3.8",4,4,4,{"$f":"IF($AZ15=\"\",\"\",IF(ISERROR(DG15),0,IF(ISNA(VLOOKUP(DF15,Tables!AG$5:AH$100,2,FALSE)),\"0\",VLOOKUP(DF15,Tables!AG$5:AH$100,2,FALSE))))","v":2},"4-13 4.2L","4",4,{"$f":"IF($AZ15=\"\",\"\",IF(ISERROR(DK15),0,IF(ISNA(VLOOKUP(DK15,Tables!AI$5:AJ$100,2,FALSE)),\"0\",VLOOKUP(DK15,Tables!AI$5:AJ$100,2,FALSE))))","v":2},"4.2L","4.2",4,4,4,{"$f":"IF($AZ15=\"\",\"\",IF(ISERROR(DQ15),0,IF(ISNA(VLOOKUP(DP15,Tables!AK$5:AL$100,2,FALSE)),\"0\",VLOOKUP(DP15,Tables!AK$5:AL$100,2,FALSE))))","v":2},"9-12 7.6L","9",9,{"$f":"IF($AZ15=\"\",\"\",IF(ISERROR(DU15),0,IF(ISNA(VLOOKUP(DU15,Tables!AM$5:AN$100,2,FALSE)),\"0\",VLOOKUP(DU15,Tables!AM$5:AN$100,2,FALSE))))","v":0},"7.6L","7.6",7.5,7.5,7.5,{"$f":"IF($BB15=\"\",\"\",IF(ISERROR(EA15),0,IF(ISNA(VLOOKUP(DZ15,Tables!AO$5:AP$100,2,FALSE)),\"0\",VLOOKUP(DZ15,Tables!AO$5:AP$100,2,FALSE))))","v":0},{"$f":"IF(AZ15=\"\",\"\",VLOOKUP(AZ15,Race!$C$1:$N$100,12,FALSE))","v":89},"89",89,{"$f":"IF($BB15=\"\",\"\",IF(ISNA(VLOOKUP(EE15,Tables!AQ$5:AR$100,2,FALSE)),\"0\",VLOOKUP(EE15,Tables!AQ$5:AR$100,2,FALSE)))","v":0},{"$f":"IF(AZ15=\"\",\"\",IF(MainSheet!D22=\"Scratched\",\"\",BC15+BE15+BG15+BL15+BO15+BR15+BU15+BY15+CB15+CE15+CH15+CL15+CP15+CT15+CX15+DB15+DH15+DL15+DR15+DV15+EB15+EF15))","v":30},{"$error":"#N/A"},{"$error":"#N/A"}]
[{"$f":"IF(RaceLists!A16=\"\",\"\",IF(RaceLists!A16=\"END\",\"END\",IF(RaceLists!E16=\"\",\"\",getAddress(RaceLists!E16))))","v":"http://formguide.cyberhorse.com.au/index.php/Form/form.html?formdate=2010-11-24&track=D'Ben&raceno=5"},{"$nulls":11},{"$f":"IF(Meetings!B16=\"\",\"\",LEFT(Meetings!B16,FIND(\"(\",Meetings!B16)-2))","v":"MILDURA"},"MILDURA",{"$f":"IF(Meetings!D16=\"\",\"\",getAddress(Meetings!D16))","v":"http://www.tabonline.com.au/2010/11/24/MT01.html"},{"$f":"IF(Meetings!E16=\"\",\"\",getAddress(Meetings!E16))","v":"http://www.tabonline.com.au/2010/11/24/MT02.html"},{"$f":"IF(Meetings!F16=\"\",\"\",getAddress(Meetings!F16))","v":"http://www.tabonline.com.au/2010/11/24/MT03.html"},{"$f":"IF(Meetings!G16=\"\",\"\",getAddress(Meetings!G16))","v":"http://www.tabonline.com.au/2010/11/24/MT04.html"},{"$f":"IF(Meetings!H16=\"\",\"\",getAddress(Meetings!H16))","v":"http://www.tabonline.com.au/2010/11/24/MT05.html"},{"$f":"IF(Meetings!I16=\"\",\"\",getAddress(Meetings!I16))","v":"http://www.tabonline.com.au/2010/11/24/MT06.html"},{"$f":"IF(Meetings!J16=\"\",\"\",getAddress(Meetings!J16))","v":"http://www.tabonline.com.au/2010/11/24/MT07.html"},{"$f":"IF(Meetings!K16=\"\",\"\",getAddress(Meetings!K16))","v":"http://www.tabonline.com.au/2010/11/24/MT08.html"},{"$f":"IF(Meetings!L16=\"\",\"\",getAddress(Meetings!L16))","v":""},{"$f":"IF(Meetings!M16=\"\",\"\",getAddress(Meetings!M16))","v":""},{"$f":"IF(Meetings!N16=\"\",\"\",getAddress(Meetings!N16))","v":""},"",12,{"$nulls":24},{"$f":"IF(Form!I19<>\"\",LEFT(Form!C19,FIND(\"(\",Form!C19)-2),\"\")","v":"Boolcunda Gold"},null,{"$f":"IF(AZ16=\"\",\"\",Form!A19)","v":15},{"$f":"IF($AZ16=\"\",\"\",IF(ISNA(VLOOKUP(BB16,Tables!A$5:B$100,2,FALSE)),\"0\",VLOOKUP(BB16,Tables!A$5:B$100,2,FALSE)))","v":0},{"$f":"IF($AZ16=\"\",\"\",VLOOKUP(AZ16,Race!$C$1:$N$100,7,FALSE))","v":3},{"$f":"IF($AZ16=\"\",\"\",IF(ISNA(VLOOKUP(BD16,Tables!C$5:D$100,2,FALSE)),\"0\",VLOOKUP(BD16,Tables!C$5:D$100,2,FALSE)))","v":5},{"$f":"IF(AZ16=\"\",\"\",Form!F19)","v":55.5},{"$f":"IF($AZ16=\"\",\"\",IF(ISNA(VLOOKUP(BF16,Tables!E$5:F$100,2,FALSE)),\"0\",VLOOKUP(BF16,Tables!E$5:F$100,2,FALSE)))","v":3}," Cd 55.5-0.0"," Cd 55.5",0,"55.5",{"$f":"IF($AZ16=\"\",\"\",IF(ISERROR(BK16),0,IF(ISNA(VLOOKUP(BJ16,Tables!G$5:H$100,2,FALSE)),\"0\",VLOOKUP(BJ16,Tables!G19:H$100,2,FALSE))))","v":3},{"$f":"IF($AZ16=\"\",\"\",Form!G19)","v":0},16,{"$f":"IF($AZ16=\"\",\"\",IF(ISNA(VLOOKUP(BN16,Tables!I$5:J$100,2,FALSE)),\"0\",VLOOKUP(BN16,Tables!I$5:J$100,2,FALSE)))","v":0},{"$f":"IF($AZ16=\"\",\"\",Form!H19)","v":0},1,{"$f":"IF($AZ16=\"\",\"\",IF(ISNA(VLOOKUP(BQ16,Tables!K$5:L$100,2,FALSE)),\"0\",VLOOKUP(BQ16,Tables!K$5:L$100,2,FALSE)))","v":8},{"$f":"IF($AZ16=\"\",\"\",Form!I19)","v":0},11,{"$f":"IF($AZ16=\"\",\"\",IF(ISNA(VLOOKUP(BT16,Tables!M$5:N$100,2,FALSE)),\"0\",VLOOKUP(BT16,Tables!M$5:N$100,2,FALSE)))","v":2},{"$f":"IF($AZ16=\"\",\"\",INDEX(Race!$D$1:$P$100,MATCH($AZ16,Race!$C$1:$C$100,0)+0,9))","v":0},"","N",{"$f":"IF($AZ16=\"\",\"\",IF(ISNA(VLOOKUP(BX16,Tables!O$5:P$100,2,FALSE)),0,VLOOKUP(BX16,Tables!O$5:P$100,2,FALSE)))","v":0},"","N",{"$f":"IF($AZ16=\"\",\"\",IF(ISNA(VLOOKUP(CA16,Tables!Q$5:R$100,2,FALSE)),0,VLOOKUP(CA16,Tables!Q$5:R$100,2,FALSE)))","v":0},"","N",{"$f":"IF($AZ16=\"\",\"\",IF(ISNA(VLOOKUP(CD16,Tables!S$5:T$100,2,FALSE)),0,VLOOKUP(CD16,Tables!S$5:T$100,2,FALSE)))","v":0},"","N",{"$f":"IF($AZ16=\"\",\"\",IF(ISNA(VLOOKUP(CG16,Tables!U$5:V$100,2,FALSE)),0,VLOOKUP(CG16,Tables!U$5:V$100,2,FALSE)))","v":0},"2010-11-14",10,10,{"$f":"IF($AZ16=\"\",\"\",IF(ISERROR(CK16),0,IF(ISNA(VLOOKUP(CK16,Tables!W$5:X$100,2,FALSE)),\"0\",VLOOKUP(CK16,Tables!W$5:X$100,2,FALSE))))","v":5},"2010-10-27",28,28,{"$f":"IF($AZ16=\"\",\"\",IF(ISERROR(CO16),0,IF(ISNA(VLOOKUP(CO16,Tables!Y$5:Z$100,2,FALSE)),\"0\",VLOOKUP(CO16,Tables!Y$5:Z$100,2,FALSE))))","v":2},"00:00:00",40506,0,{"$f":"IF($AZ16=\"\",\"\",IF(ISERROR(CS16),0,IF(ISNA(VLOOKUP(CS16,Tables!AA$5:AB$100,2,FALSE)),\"0\",VLOOKUP(CS16,Tables!AA$5:AB$100,2,FALSE))))","v":0},8500,{"$f":"IF(CU16=\"\",\"\",(Form!$H$3-CU16)/CU16*100)","v":17.647058823529413},1,{"$f":"IF($AZ16=\"\",\"\",IF(ISERROR(CW16),0,IF(ISNA(VLOOKUP(CW16,Tables!AC$5:AD$100,2,FALSE)),\"0\",VLOOKUP(CW16,Tables!AC$5:AD$100,2,FALSE))))","v":-5},"8-12 5.6L","8",8,{"$f":"IF($AZ16=\"\",\"\",IF(ISERROR(DA16),0,IF(ISNA(VLOOKUP(DA16,Tables!AE$5:AF$100,2,FALSE)),\"0\",VLOOKUP(DA16,Tables!AE$5:AF$100,2,FALSE))))","v":0},"5.6L","5.6",5.5,5.5,5.5,{"$f":"IF($AZ16=\"\",\"\",IF(ISERROR(DG16),0,IF(ISNA(VLOOKUP(DF16,Tables!AG$5:AH$100,2,FALSE)),\"0\",VLOOKUP(DF16,Tables!AG$5:AH$100,2,FALSE))))","v":0},"9-13 10.3L","9",9,{"$f":"IF($AZ16=\"\",\"\",IF(ISERROR(DK16),0,IF(ISNA(VLOOKUP(DK16,Tables!AI$5:AJ$100,2,FALSE)),\"0\",VLOOKUP(DK16,Tables!AI$5:AJ$100,2,FALSE))))","v":0},"0.3L","0.3",0.5,0.5,0.5,{"$f":"IF($AZ16=\"\",\"\",IF(ISERROR(DQ16),0,IF(ISNA(VLOOKUP(DP16,Tables!AK$5:AL$100,2,FALSE)),\"0\",VLOOKUP(DP16,Tables!AK$5:AL$100,2,FALSE))))","v":7},"16 Steely Resolve (5) 57.0kg 4yo b h",{"$error":"#VALUE!"},{"$error":"#VALUE!"},{"$f":"IF($AZ16=\"\",\"\",IF(ISERROR(DU16),0,IF(ISNA(VLOOKUP(DU16,Tables!AM$5:AN$100,2,FALSE)),\"0\",VLOOKUP(DU16,Tables!AM$5:AN$100,2,FALSE))))","v":0}," h",{"$error":"#VALUE!"},{"$error":"#VALUE!"},{"$error":"#VALUE!"},{"$error":"#VALUE!"},{"$f":"IF($BB16=\"\",\"\",IF(ISERROR(EA16),0,IF(ISNA(VLOOKUP(DZ16,Tables!AO$5:AP$100,2,FALSE)),\"0\",VLOOKUP(DZ16,Tables!AO$5:AP$100,2,FALSE))))","v":0},{"$f":"IF(AZ16=\"\",\"\",VLOOKUP(AZ16,Race!$C$1:$N$100,12,FALSE))","v":0},"0",0,{"$f":"IF($BB16=\"\",\"\",IF(ISNA(VLOOKUP(EE16,Tables!AQ$5:AR$100,2,FALSE)),\"0\",VLOOKUP(EE16,Tables!AQ$5:AR$100,2,FALSE)))","v":0},{"$f":"IF(AZ16=\"\",\"\",IF(MainSheet!D23=\"Scratched\",\"\",BC16+BE16+BG16+BL16+BO16+BR16+BU16+BY16+CB16+CE16+CH16+CL16+CP16+CT16+CX16+DB16+DH16+DL16+DR16+DV16+EB16+EF16))","v":""},"",""]
[{"$f":"IF(RaceLists!A17=\"\",\"\",IF(RaceLists!A17=\"END\",\"END\",IF(RaceLists!E17=\"\",\"\",getAddress(RaceLists!E17))))","v":"http://formguide.cyberhorse.com.au/index.php/Form/form.html?formdate=2010-11-24&track=D'Ben&raceno=6"},{"$nulls":11},{"$f":"IF(Meetings!B17=\"\",\"\",LEFT(Meetings!B17,FIND(\"(\",Meetings!B17)-2))","v":""},"",{"$f":"IF(Meetings!D17=\"\",\"\",getAddress(Meetings!D17))","v":{"$error":"#VALUE!"}},{"$f":"IF(Meetings!E17=\"\",\"\",getAddress(Meetings!E17))","v":{"$error":"#VALUE!"}},{"$f":"IF(Meetings!F17=\"\",\"\",getAddress(Meetings!F17))","v":{"$error":"#VALUE!"}},{"$f":"IF(Meetings!G17=\"\",\"\",getAddress(Meetings!G17))","v":{"$error":"#VALUE!"}},{"$f":"IF(Meetings!H17=\"\",\"\",getAddress(Meetings!H17))","v":{"$error":"#VALUE!"}},{"$f":"IF(Meetings!I17=\"\",\"\",getAddress(Meetings!I17))","v":{"$error":"#VALUE!"}},{"$f":"IF(Meetings!J17=\"\",\"\",getAddress(Meetings!J17))","v":{"$error":"#VALUE!"}},{"$f":"IF(Meetings!K17=\"\",\"\",getAddress(Meetings!K17))","v":{"$error":"#VALUE!"}},{"$f":"IF(Meetings!L17=\"\",\"\",getAddress(Meetings!L17))","v":{"$error":"#VALUE!"}},{"$f":"IF(Meetings!M17=\"\",\"\",getAddress(Meetings!M17))","v":{"$error":"#VALUE!"}},{"$f":"IF(Meetings!N17=\"\",\"\",getAddress(Meetings!N17))","v":{"$error":"#VALUE!"}},"",13,{"$nulls":24},{"$f":"IF(Form!I20<>\"\",LEFT(Form!C20,FIND(\"(\",Form!C20)-2),\"\")","v":"Steely Resolve"},null,{"$f":"IF(AZ17=\"\",\"\",Form!A20)","v":16},{"$f":"IF($AZ17=\"\",\"\",IF(ISNA(VLOOKUP(BB17,Tables!A$5:B$100,2,FALSE)),\"0\",VLOOKUP(BB17,Tables!A$5:B$100,2,FALSE)))","v":0},{"$f":"IF($AZ17=\"\",\"\",VLOOKUP(AZ17,Race!$C$1:$N$100,7,FALSE))","v":5},{"$f":"IF($AZ17=\"\",\"\",IF(ISNA(VLOOKUP(BD17,Tables!C$5:D$100,2,FALSE)),\"0\",VLOOKUP(BD17,Tables!C$5:D$100,2,FALSE)))","v":3},{"$f":"IF(AZ17=\"\",\"\",Form!F20)","v":57},{"$f":"IF($AZ17=\"\",\"\",IF(ISNA(VLOOKUP(BF17,Tables!E$5:F$100,2,FALSE)),\"0\",VLOOKUP(BF17,Tables!E$5:F$100,2,FALSE)))","v":5}," Cd 57.0-0.0"," Cd 57.0",0,"57.0",{"$f":"IF($AZ17=\"\",\"\",IF(ISERROR(BK17),0,IF(ISNA(VLOOKUP(BJ17,Tables!G$5:H$100,2,FALSE)),\"0\",VLOOKUP(BJ17,Tables!G20:H$100,2,FALSE))))","v":3},{"$f":"IF($AZ17=\"\",\"\",Form!G20)","v":0.2},11,{"$f":"IF($AZ17=\"\",\"\",IF(ISNA(VLOOKUP(BN17,Tables!I$5:J$100,2,FALSE)),\"0\",VLOOKUP(BN17,Tables!I$5:J$100,2,FALSE)))","v":2},{"$f":"IF($AZ17=\"\",\"\",Form!H20)","v":0},1,{"$f":"IF($AZ17=\"\",\"\",IF(ISNA(VLOOKUP(BQ17,Tables!K$5:L$100,2,FALSE)),\"0\",VLOOKUP(BQ17,Tables!K$5:L$100,2,FALSE)))","v":8},{"$f":"IF($AZ17=\"\",\"\",Form!I20)","v":0},11,{"$f":"IF($AZ17=\"\",\"\",IF(ISNA(VLOOKUP(BT17,Tables!M$5:N$100,2,FALSE)),\"0\",VLOOKUP(BT17,Tables!M$5:N$100,2,FALSE)))","v":2},{"$f":"IF($AZ17=\"\",\"\",INDEX(Race!$D$1:$P$100,MATCH($AZ17,Race!$C$1:$C$100,0)+0,9))","v":0},"","N",{"$f":"IF($AZ17=\"\",\"\",IF(ISNA(VLOOKUP(BX17,Tables!O$5:P$100,2,FALSE)),0,VLOOKUP(BX17,Tables!O$5:P$100,2,FALSE)))","v":0},"","N",{"$f":"IF($AZ17=\"\",\"\",IF(ISNA(VLOOKUP(CA17,Tables!Q$5:R$100,2,FALSE)),0,VLOOKUP(CA17,Tables!Q$5:R$100,2,FALSE)))","v":0},"","N",{"$f":"IF($AZ17=\"\",\"\",IF(ISNA(VLOOKUP(CD17,Tables!S$5:T$100,2,FALSE)),0,VLOOKUP(CD17,Tables!S$5:T$100,2,FALSE)))","v":0},"","N",{"$f":"IF($AZ17=\"\",\"\",IF(ISNA(VLOOKUP(CG17,Tables!U$5:V$100,2,FALSE)),0,VLOOKUP(CG17,Tables!U$5:V$100,2,FALSE)))","v":0},"2010-11-02",22,22,{"$f":"IF($AZ17=\"\",\"\",IF(ISERROR(CK17),0,IF(ISNA(VLOOKUP(CK17,Tables!W$5:X$100,2,FALSE)),\"0\",VLOOKUP(CK17,Tables!W$5:X$100,2,FALSE))))","v":0},"2010-06-26",151,0,{"$f":"IF($AZ17=\"\",\"\",IF(ISERROR(CO17),0,IF(ISNA(VLOOKUP(CO17,Tables!Y$5:Z$100,2,FALSE)),\"0\",VLOOKUP(CO17,Tables!Y$5:Z$100,2,FALSE))))","v":0},"00:00:00",40506,0,{"$f":"IF($AZ17=\"\",\"\",IF(ISERROR(CS17),0,IF(ISNA(VLOOKUP(CS17,Tables!AA$5:AB$100,2,FALSE)),\"0\",VLOOKUP(CS17,Tables!AA$5:AB$100,2,FALSE))))","v":0},10000,{"$f":"IF(CU17=\"\",\"\",(Form!$H$3-CU17)/CU17*100)","v":0},3,{"$f":"IF($AZ17=\"\",\"\",IF(ISERROR(CW17),0,IF(ISNA(VLOOKUP(CW17,Tables!AC$5:AD$100,2,FALSE)),\"0\",VLOOKUP(CW17,Tables!AC$5:AD$100,2,FALSE))))","v":0},"7-13 4.6L","7",7,{"$f":"IF($AZ17=\"\",\"\",IF(ISERROR(DA17),0,IF(ISNA(VLOOKUP(DA17,Tables!AE$5:AF$100,2,FALSE)),\"0\",VLOOKUP(DA17,Tables!AE$5:AF$100,2,FALSE))))","v":0},"4.6L","4.6",4.5,4.5,4.5,{"$f":"IF($AZ17=\"\",\"\",IF(ISERROR(DG17),0,IF(ISNA(VLOOKUP(DF17,Tables!AG$5:AH$100,2,FALSE)),\"0\",VLOOKUP(DF17,Tables!AG$5:AH$100,2,FALSE))))","v":2},"8-13 5.5L","8",8,{"$f":"IF($AZ17=\"\",\"\",IF(ISERROR(DK17),0,IF(ISNA(VLOOKUP(DK17,Tables!AI$5:AJ$100,2,FALSE)),\"0\",VLOOKUP(DK17,Tables!AI$5:AJ$100,2,FALSE))))","v":0},"5.5L","5.5",5.5,5.5,5.5,{"$f":"IF($AZ17=\"\",\"\",IF(ISERROR(DQ17),0,IF(ISNA(VLOOKUP(DP17,Tables!AK$5:AL$100,2,FALSE)),\"0\",VLOOKUP(DP17,Tables!AK$5:AL$100,2,FALSE))))","v":0},"17 Mr Diligent (15) 55.5kg 3yo br g",{"$error":"#VALUE!"},{"$error":"#VALUE!"},{"$f":"IF($AZ17=\"\",\"\",IF(ISERROR(DU17),0,IF(ISNA(VLOOKUP(DU17,Tables!AM$5:AN$100,2,FALSE)),\"0\",VLOOKUP(DU17,Tables!AM$5:AN$100,2,FALSE))))","v":0}," g",{"$error":"#VALUE!"},{"$error":"#VALUE!"},{"$error":"#VALUE!"},{"$error":"#VALUE!"},{"$f":"IF($BB17=\"\",\"\",IF(ISERROR(EA17),0,IF(ISNA(VLOOKUP(DZ17,Tables!AO$5:AP$100,2,FALSE)),\"0\",VLOOKUP(DZ17,Tables!AO$5:AP$100,2,FALSE))))","v":0},{"$f":"IF(AZ17=\"\",\"\",VLOOKUP(AZ17,Race!$C$1:$N$100,12,FALSE))","v":0},"0",0,{"$f":"IF($BB17=\"\",\"\",IF(ISNA(VLOOKUP(EE17,Tables!AQ$5:AR$100,2,FALSE)),\"0\",VLOOKUP(EE17,Tables!AQ$5:AR$100,2,FALSE)))","v":0},{"$f":"IF(AZ17=\"\",\"\",IF(MainSheet!D24=\"Scratched\",\"\",BC17+BE17+BG17+BL17+BO17+BR17+BU17+BY17+CB17+CE17+CH17+CL17+CP17+CT17+CX17+DB17+DH17+DL17+DR17+DV17+EB17+EF17))","v":""},"",""]
[{"$f":"IF(RaceLists!A18=\"\",\"\",IF(RaceLists!A18=\"END\",\"END\",IF(RaceLists!E18=\"\",\"\",getAddress(RaceLists!E18))))","v":"http://formguide.cyberhorse.com.au/index.php/Form/form.html?formdate=2010-11-24&track=D'Ben&raceno=7"},{"$nulls":11},{"$f":"IF(Meetings!B18=\"\",\"\",LEFT(Meetings!B18,FIND(\"(\",Meetings!B18)-2))","v":"ALBION PARK"},"ALBION",{"$f":"IF(Meetings!D18=\"\",\"\",getAddress(Meetings!D18))","v":"http://www.tabonline.com.au/2010/11/24/BG01.html"},{"$f":"IF(Meetings!E18=\"\",\"\",getAddress(Meetings!E18))","v":"http://www.tabonline.com.au/2010/11/24/BG02.html"},{"$f":"IF(Meetings!F18=\"\",\"\",getAddress(Meetings!F18))","v":"http://www.tabonline.com.au/2010/11/24/BG03.html"},{"$f":"IF(Meetings!G18=\"\",\"\",getAddress(Meetings!G18))","v":"http://www.tabonline.com.au/2010/11/24/BG04.html"},{"$f":"IF(Meetings!H18=\"\",\"\",getAddress(Meetings!H18))","v":"http://www.tabonline.com.au/2010/11/24/BG05.html"},{"$f":"IF(Meetings!I18=\"\",\"\",getAddress(Meetings!I18))","v":"http://www.tabonline.com.au/2010/11/24/BG06.html"},{"$f":"IF(Meetings!J18=\"\",\"\",getAddress(Meetings!J18))","v":"http://www.tabonline.com.au/2010/11/24/BG07.html"},{"$f":"IF(Meetings!K18=\"\",\"\",getAddress(Meetings!K18))","v":"http://www.tabonline.com.au/2010/11/24/BG08.html"},{"$f":"IF(Meetings!L18=\"\",\"\",getAddress(Meetings!L18))","v":"http://www.tabonline.com.au/2010/11/24/BG09.html"},{"$f":"IF(Meetings!M18=\"\",\"\",getAddress(Meetings!M18))","v":"http://www.tabonline.com.au/2010/11/24/BG10.html"},{"$f":"IF(Meetings!N18=\"\",\"\",getAddress(Meetings!N18))","v":""},"",14,{"$nulls":24},{"$f":"IF(Form!I21<>\"\",LEFT(Form!C21,FIND(\"(\",Form!C21)-2),\"\")","v":"Mr Diligent"},null,{"$f":"IF(AZ18=\"\",\"\",Form!A21)","v":17},{"$f":"IF($AZ18=\"\",\"\",IF(ISNA(VLOOKUP(BB18,Tables!A$5:B$100,2,FALSE)),\"0\",VLOOKUP(BB18,Tables!A$5:B$100,2,FALSE)))","v":0},{"$f":"IF($AZ18=\"\",\"\",VLOOKUP(AZ18,Race!$C$1:$N$100,7,FALSE))","v":15},{"$f":"IF($AZ18=\"\",\"\",IF(ISNA(VLOOKUP(BD18,Tables!C$5:D$100,2,FALSE)),\"0\",VLOOKUP(BD18,Tables!C$5:D$100,2,FALSE)))","v":0},{"$f":"IF(AZ18=\"\",\"\",Form!F21)","v":55.5},{"$f":"IF($AZ18=\"\",\"\",IF(ISNA(VLOOKUP(BF18,Tables!E$5:F$100,2,FALSE)),\"0\",VLOOKUP(BF18,Tables!E$5:F$100,2,FALSE)))","v":3}," Cd 55.5-0.0"," Cd 55.5",0,"55.5",{"$f":"IF($AZ18=\"\",\"\",IF(ISERROR(BK18),0,IF(ISNA(VLOOKUP(BJ18,Tables!G$5:H$100,2,FALSE)),\"0\",VLOOKUP(BJ18,Tables!G21:H$100,2,FALSE))))","v":3},{"$f":"IF($AZ18=\"\",\"\",Form!G21)","v":0.1},13,{"$f":"IF($AZ18=\"\",\"\",IF(ISNA(VLOOKUP(BN18,Tables!I$5:J$100,2,FALSE)),\"0\",VLOOKUP(BN18,Tables!I$5:J$100,2,FALSE)))","v":0},{"$f":"IF($AZ18=\"\",\"\",Form!H21)","v":0},1,{"$f":"IF($AZ18=\"\",\"\",IF(ISNA(VLOOKUP(BQ18,Tables!K$5:L$100,2,FALSE)),\"0\",VLOOKUP(BQ18,Tables!K$5:L$100,2,FALSE)))","v":8},{"$f":"IF($AZ18=\"\",\"\",Form!I21)","v":0},11,{"$f":"IF($AZ18=\"\",\"\",IF(ISNA(VLOOKUP(BT18,Tables!M$5:N$100,2,FALSE)),\"0\",VLOOKUP(BT18,Tables!M$5:N$100,2,FALSE)))","v":2},{"$f":"IF($AZ18=\"\",\"\",INDEX(Race!$D$1:$P$100,MATCH($AZ18,Race!$C$1:$C$100,0)+0,9))","v":0},"","N",{"$f":"IF($AZ18=\"\",\"\",IF(ISNA(VLOOKUP(BX18,Tables!O$5:P$100,2,FALSE)),0,VLOOKUP(BX18,Tables!O$5:P$100,2,FALSE)))","v":0},"","N",{"$f":"IF($AZ18=\"\",\"\",IF(ISNA(VLOOKUP(CA18,Tables!Q$5:R$100,2,FALSE)),0,VLOOKUP(CA18,Tables!Q$5:R$100,2,FALSE)))","v":0},"","N",{"$f":"IF($AZ18=\"\",\"\",IF(ISNA(VLOOKUP(CD18,Tables!S$5:T$100,2,FALSE)),0,VLOOKUP(CD18,Tables!S$5:T$100,2,FALSE)))","v":0},"","N",{"$f":"IF($AZ18=\"\",\"\",IF(ISNA(VLOOKUP(CG18,Tables!U$5:V$100,2,FALSE)),0,VLOOKUP(CG18,Tables!U$5:V$100,2,FALSE)))","v":0},"2010-11-17",7,7,{"$f":"IF($AZ18=\"\",\"\",IF(ISERROR(CK18),0,IF(ISNA(VLOOKUP(CK18,Tables!W$5:X$100,2,FALSE)),\"0\",VLOOKUP(CK18,Tables!W$5:X$100,2,FALSE))))","v":5},"2010-09-19",66,66,{"$f":"IF($AZ18=\"\",\"\",IF(ISERROR(CO18),0,IF(ISNA(VLOOKUP(CO18,Tables!Y$5:Z$100,2,FALSE)),\"0\",VLOOKUP(CO18,Tables!Y$5:Z$100,2,FALSE))))","v":0},"2010-05-15",193,0,{"$f":"IF($AZ18=\"\",\"\",IF(ISERROR(CS18),0,IF(ISNA(VLOOKUP(CS18,Tables!AA$5:AB$100,2,FALSE)),\"0\",VLOOKUP(CS18,Tables!AA$5:AB$100,2,FALSE))))","v":0},10000,{"$f":"IF(CU18=\"\",\"\",(Form!$H$3-CU18)/CU18*100)","v":0},3,{"$f":"IF($AZ18=\"\",\"\",IF(ISERROR(CW18),0,IF(ISNA(VLOOKUP(CW18,Tables!AC$5:AD$100,2,FALSE)),\"0\",VLOOKUP(CW18,Tables!AC$5:AD$100,2,FALSE))))","v":0},"11-12 11.6L","11",0,{"$f":"IF($AZ18=\"\",\"\",IF(ISERROR(DA18),0,IF(ISNA(VLOOKUP(DA18,Tables!AE$5:AF$100,2,FALSE)),\"0\",VLOOKUP(DA18,Tables!AE$5:AF$100,2,FALSE))))","v":0},"11.6L","11.6",11.5,11.5,11.5,{"$f":"IF($AZ18=\"\",\"\",IF(ISERROR(DG18),0,IF(ISNA(VLOOKUP(DF18,Tables!AG$5:AH$100,2,FALSE)),\"0\",VLOOKUP(DF18,Tables!AG$5:AH$100,2,FALSE))))","v":"0"},"6-7 4.8L","6",6,{"$f":"IF($AZ18=\"\",\"\",IF(ISERROR(DK18),0,IF(ISNA(VLOOKUP(DK18,Tables!AI$5:AJ$100,2,FALSE)),\"0\",VLOOKUP(DK18,Tables!AI$5:AJ$100,2,FALSE))))","v":0},".8L",".8",1,1,1,{"$f":"IF($AZ18=\"\",\"\",IF(ISERROR(DQ18),0,IF(ISNA(VLOOKUP(DP18,Tables!AK$5:AL$100,2,FALSE)),\"0\",VLOOKUP(DP18,Tables!AK$5:AL$100,2,FALSE))))","v":7},"9-9 16.5L","9",9,{"$f":"IF($AZ18=\"\",\"\",IF(ISERROR(DU18),0,IF(ISNA(VLOOKUP(DU18,Tables!AM$5:AN$100,2,FALSE)),\"0\",VLOOKUP(DU18,Tables!AM$5:AN$100,2,FALSE))))","v":0},".5L",".5",0.5,0.5,0.5,{"$f":"IF($BB18=\"\",\"\",IF(ISERROR(EA18),0,IF(ISNA(VLOOKUP(DZ18,Tables!AO$5:AP$100,2,FALSE)),\"0\",VLOOKUP(DZ18,Tables!AO$5:AP$100,2,FALSE))))","v":7},{"$f":"IF(AZ18=\"\",\"\",VLOOKUP(AZ18,Race!$C$1:$N$100,12,FALSE))","v":0},"0",0,{"$f":"IF($BB18=\"\",\"\",IF(ISNA(VLOOKUP(EE18,Tables!AQ$5:AR$100,2,FALSE)),\"0\",VLOOKUP(EE18,Tables!AQ$5:AR$100,2,FALSE)))","v":0},{"$f":"IF(AZ18=\"\",\"\",IF(MainSheet!D25=\"Scratched\",\"\",BC18+BE18+BG18+BL18+BO18+BR18+BU18+BY18+CB18+CE18+CH18+CL18+CP18+CT18+CX18+DB18+DH18+DL18+DR18+DV18+EB18+EF18))","v":""},"",""]
[{"$f":"IF(RaceLists!A19=\"\",\"\",IF(RaceLists!A19=\"END\",\"END\",IF(RaceLists!E19=\"\",\"\",getAddress(RaceLists!E19))))","v":""},{"$nulls":11},{"$f":"A3","v":"http://formguide.cyberhorse.com.au/index.php/Form/form.html?formdate=2010-11-24&track=Bunbry&raceno=1"},"http://formguide.cyberhorse.com.au/index.php/Form/form.html?formdate=2010",{"$f":"IF(Meetings!D19=\"\",\"\",getAddress(Meetings!D19))","v":"http://www.tabonline.com.au/2010/11/24/SG01.html"},{"$f":"IF(Meetings!E19=\"\",\"\",getAddress(Meetings!E19))","v":"http://www.tabonline.com.au/2010/11/24/SG02.html"},{"$f":"IF(Meetings!F19=\"\",\"\",getAddress(Meetings!F19))","v":"http://www.tabonline.com.au/2010/11/24/SG03.html"},{"$f":"IF(Meetings!G19=\"\",\"\",getAddress(Meetings!G19))","v":"http://www.tabonline.com.au/2010/11/24/SG04.html"},{"$f":"IF(Meetings!H19=\"\",\"\",getAddress(Meetings!H19))","v":"http://www.tabonline.com.au/2010/11/24/SG05.html"},{"$f":"IF(Meetings!I19=\"\",\"\",getAddress(Meetings!I19))","v":"http://www.tabonline.com.au/2010/11/24/SG06.html"},{"$f":"IF(Meetings!J19=\"\",\"\",getAddress(Meetings!J19))","v":"http://www.tabonline.com.au/2010/11/24/SG07.html"},{"$f":"IF(Meetings!K19=\"\",\"\",getAddress(Meetings!K19))","v":"http://www.tabonline.com.au/2010/11/24/SG08.html"},{"$f":"IF(Meetings!L19=\"\",\"\",getAddress(Meetings!L19))","v":"http://www.tabonline.com.au/2010/11/24/SG09.html"},{"$f":"IF(Meetings!M19=\"\",\"\",getAddress(Meetings!M19))","v":"http://www.tabonline.com.au/2010/11/24/SG10.html"},{"$f":"IF(Meetings!N19=\"\",\"\",getAddress(Meetings!N19))","v":""},"",15,{"$nulls":24},{"$f":"IF(Form!I22<>\"\",LEFT(Form!C22,FIND(\"(\",Form!C22)-2),\"\")","v":"Deed Of Honor"},null,{"$f":"IF(AZ19=\"\",\"\",Form!A22)","v":18},{"$f":"IF($AZ19=\"\",\"\",IF(ISNA(VLOOKUP(BB19,Tables!A$5:B$100,2,FALSE)),\"0\",VLOOKUP(BB19,Tables!A$5:B$100,2,FALSE)))","v":0},{"$f":"IF($AZ19=\"\",\"\",VLOOKUP(AZ19,Race!$C$1:$N$100,7,FALSE))","v":{"$error":"#N/A"}},{"$f":"IF($AZ19=\"\",\"\",IF(ISNA(VLOOKUP(BD19,Tables!C$5:D$100,2,FALSE)),\"0\",VLOOKUP(BD19,Tables!C$5:D$100,2,FALSE)))","v":"0"},{"$f":"IF(AZ19=\"\",\"\",Form!F22)","v":57},{"$f":"IF($AZ19=\"\",\"\",IF(ISNA(VLOOKUP(BF19,Tables!E$5:F$100,2,FALSE)),\"0\",VLOOKUP(BF19,Tables!E$5:F$100,2,FALSE)))","v":5}," Cd 53.0--3.0"," Cd 53.0",4,"53.0",{"$f":"IF($AZ19=\"\",\"\",IF(ISERROR(BK19),0,IF(ISNA(VLOOKUP(BJ19,Tables!G$5:H$100,2,FALSE)),\"0\",VLOOKUP(BJ19,Tables!G22:H$100,2,FALSE))))","v":{"$error":"#N/A"}},{"$f":"IF($AZ19=\"\",\"\",Form!G22)","v":0.1},13,{"$f":"IF($AZ19=\"\",\"\",IF(ISNA(VLOOKUP(BN19,Tables!I$5:J$100,2,FALSE)),\"0\",VLOOKUP(BN19,Tables!I$5:J$100,2,FALSE)))","v":0},{"$f":"IF($AZ19=\"\",\"\",Form!H22)","v":0},1,{"$f":"IF($AZ19=\"\",\"\",IF(ISNA(VLOOKUP(BQ19,Tables!K$5:L$100,2,FALSE)),\"0\",VLOOKUP(BQ19,Tables!K$5:L$100,2,FALSE)))","v":8},{"$f":"IF($AZ19=\"\",\"\",Form!I22)","v":0},11,{"$f":"IF($AZ19=\"\",\"\",IF(ISNA(VLOOKUP(BT19,Tables!M$5:N$100,2,FALSE)),\"0\",VLOOKUP(BT19,Tables!M$5:N$100,2,FALSE)))","v":2},{"$f":"IF($AZ19=\"\",\"\",INDEX(Race!$D$1:$P$100,MATCH($AZ19,Race!$C$1:$C$100,0)+0,9))","v":{"$error":"#N/A"}},"","N",{"$f":"IF($AZ19=\"\",\"\",IF(ISNA(VLOOKUP(BX19,Tables!O$5:P$100,2,FALSE)),0,VLOOKUP(BX19,Tables!O$5:P$100,2,FALSE)))","v":0},"","N",{"$f":"IF($AZ19=\"\",\"\",IF(ISNA(VLOOKUP(CA19,Tables!Q$5:R$100,2,FALSE)),0,VLOOKUP(CA19,Tables!Q$5:R$100,2,FALSE)))","v":0},"","N",{"$f":"IF($AZ19=\"\",\"\",IF(ISNA(VLOOKUP(CD19,Tables!S$5:T$100,2,FALSE)),0,VLOOKUP(CD19,Tables!S$5:T$100,2,FALSE)))","v":0},"","N",{"$f":"IF($AZ19=\"\",\"\",IF(ISNA(VLOOKUP(CG19,Tables!U$5:V$100,2,FALSE)),0,VLOOKUP(CG19,Tables!U$5:V$100,2,FALSE)))","v":0},"2010-03-31",238,0,{"$f":"IF($AZ19=\"\",\"\",IF(ISERROR(CK19),0,IF(ISNA(VLOOKUP(CK19,Tables!W$5:X$100,2,FALSE)),\"0\",VLOOKUP(CK19,Tables!W$5:X$100,2,FALSE))))","v":0},"2010-03-13",256,0,{"$f":"IF($AZ19=\"\",\"\",IF(ISERROR(CO19),0,IF(ISNA(VLOOKUP(CO19,Tables!Y$5:Z$100,2,FALSE)),\"0\",VLOOKUP(CO19,Tables!Y$5:Z$100,2,FALSE))))","v":0},"2010-03-03",266,0,{"$f":"IF($AZ19=\"\",\"\",IF(ISERROR(CS19),0,IF(ISNA(VLOOKUP(CS19,Tables!AA$5:AB$100,2,FALSE)),\"0\",VLOOKUP(CS19,Tables!AA$5:AB$100,2,FALSE))))","v":0},10000,{"$f":"IF(CU19=\"\",\"\",(Form!$H$3-CU19)/CU19*100)","v":0},3,{"$f":"IF($AZ19=\"\",\"\",IF(ISERROR(CW19),0,IF(ISNA(VLOOKUP(CW19,Tables!AC$5:AD$100,2,FALSE)),\"0\",VLOOKUP(CW19,Tables!AC$5:AD$100,2,FALSE))))","v":0},"8-11 8.3L","8",8,{"$f":"IF($AZ19=\"\",\"\",IF(ISERROR(DA19),0,IF(ISNA(VLOOKUP(DA19,Tables!AE$5:AF$100,2,FALSE)),\"0\",VLOOKUP(DA19,Tables!AE$5:AF$100,2,FALSE))))","v":0},"8.3L","8.3",8.5,8.5,8.5,{"$f":"IF($AZ19=\"\",\"\",IF(ISERROR(DG19),0,IF(ISNA(VLOOKUP(DF19,Tables!AG$5:AH$100,2,FALSE)),\"0\",VLOOKUP(DF19,Tables!AG$5:AH$100,2,FALSE))))","v":0},"10-12 11.6L","10",10,{"$f":"IF($AZ19=\"\",\"\",IF(ISERROR(DK19),0,IF(ISNA(VLOOKUP(DK19,Tables!AI$5:AJ$100,2,FALSE)),\"0\",VLOOKUP(DK19,Tables!AI$5:AJ$100,2,FALSE))))","v":0},"11.6L","11.6",11.5,11.5,11.5,{"$f":"IF($AZ19=\"\",\"\",IF(ISERROR(DQ19),0,IF(ISNA(VLOOKUP(DP19,Tables!AK$5:AL$100,2,FALSE)),\"0\",VLOOKUP(DP19,Tables!AK$5:AL$100,2,FALSE))))","v":"0"},"15-16 10.5L","15",0,{"$f":"IF($AZ19=\"\",\"\",IF(ISERROR(DU19),0,IF(ISNA(VLOOKUP(DU19,Tables!AM$5:AN$100,2,FALSE)),\"0\",VLOOKUP(DU19,Tables!AM$5:AN$100,2,FALSE))))","v":0},"10.5L","10.5",10.5,10.5,10.5,{"$f":"IF($BB19=\"\",\"\",IF(ISERROR(EA19),0,IF(ISNA(VLOOKUP(DZ19,Tables!AO$5:AP$100,2,FALSE)),\"0\",VLOOKUP(DZ19,Tables!AO$5:AP$100,2,FALSE))))","v":"0"},{"$f":"IF(AZ19=\"\",\"\",VLOOKUP(AZ19,Race!$C$1:$N$100,12,FALSE))","v":{"$error":"#N/A"}},{"$error":"#N/A"},{"$error":"#N/A"},{"$f":"IF($BB19=\"\",\"\",IF(ISNA(VLOOKUP(EE19,Tables!AQ$5:AR$100,2,FALSE)),\"0\",VLOOKUP(EE19,Tables!AQ$5:AR$100,2,FALSE)))","v":"0"},{"$f":"IF(AZ19=\"\",\"\",IF(MainSheet!D26=\"Scratched\",\"\",BC19+BE19+BG19+BL19+BO19+BR19+BU19+BY19+CB19+CE19+CH19+CL19+CP19+CT19+CX19+DB19+DH19+DL19+DR19+DV19+EB19+EF19))","v":{"$error":"#N/A"}},{"$error":"#N/A"},{"$error":"#N/A"}]
[{"$f":"IF(RaceLists!A20=\"\",\"\",IF(RaceLists!A20=\"END\",\"END\",IF(RaceLists!E20=\"\",\"\",getAddress(RaceLists!E20))))","v":"http://formguide.cyberhorse.com.au/index.php/Form/form.html?formdate=2010-11-24&track=Lakesi&raceno=1"},{"$nulls":11},{"$f":"IF(Meetings!B20=\"\",\"\",LEFT(Meetings!B20,FIND(\"(\",Meetings!B20)-2))","v":"THE MEADOWS"},"THE",{"$f":"IF(Meetings!D20=\"\",\"\",getAddress(Meetings!D20))","v":"http://www.tabonline.com.au/2010/11/24/MG01.html"},{"$f":"IF(Meetings!E20=\"\",\"\",getAddress(Meetings!E20))","v":"http://www.tabonline.com.au/2010/11/24/MG02.html"},{"$f":"IF(Meetings!F20=\"\",\"\",getAddress(Meetings!F20))","v":"http://www.tabonline.com.au/2010/11/24/MG03.html"},{"$f":"IF(Meetings!G20=\"\",\"\",getAddress(Meetings!G20))","v":"http://www.tabonline.com.au/2010/11/24/MG04.html"},{"$f":"IF(Meetings!H20=\"\",\"\",getAddress(Meetings!H20))","v":"http://www.tabonline.com.au/2010/11/24/MG05.html"},{"$f":"IF(Meetings!I20=\"\",\"\",getAddress(Meetings!I20))","v":"http://www.tabonline.com.au/2010/11/24/MG06.html"},{"$f":"IF(Meetings!J20=\"\",\"\",getAddress(Meetings!J20))","v":"http://www.tabonline.com.au/2010/11/24/MG07.html"},{"$f":"IF(Meetings!K20=\"\",\"\",getAddress(Meetings!K20))","v":"http://www.tabonline.com.au/2010/11/24/MG08.html"},{"$f":"IF(Meetings!L20=\"\",\"\",getAddress(Meetings!L20))","v":"http://www.tabonline.com.au/2010/11/24/MG09.html"},{"$f":"IF(Meetings!M20=\"\",\"\",getAddress(Meetings!M20))","v":"http://www.tabonline.com.au/2010/11/24/MG10.html"},{"$f":"IF(Meetings!N20=\"\",\"\",getAddress(Meetings!N20))","v":"http://www.tabonline.com.au/2010/11/24/MG11.html"},"","1900-01-16",{"$nulls":24},{"$f":"IF(Form!I23<>\"\",LEFT(Form!C23,FIND(\"(\",Form!C23)-2),\"\")","v":"Pack Saddle"},null,{"$f":"IF(AZ20=\"\",\"\",Form!A23)","v":18},{"$f":"IF($AZ20=\"\",\"\",IF(ISNA(VLOOKUP(BB20,Tables!A$5:B$100,2,FALSE)),\"0\",VLOOKUP(BB20,Tables!A$5:B$100,2,FALSE)))","v":0},{"$f":"IF($AZ20=\"\",\"\",VLOOKUP(AZ20,Race!$C$1:$N$100,7,FALSE))","v":13},{"$f":"IF($AZ20=\"\",\"\",IF(ISNA(VLOOKUP(BD20,Tables!C$5:D$100,2,FALSE)),\"0\",VLOOKUP(BD20,Tables!C$5:D$100,2,FALSE)))","v":0},{"$f":"IF(AZ20=\"\",\"\",Form!F23)","v":57},{"$f":"IF($AZ20=\"\",\"\",IF(ISNA(VLOOKUP(BF20,Tables!E$5:F$100,2,FALSE)),\"0\",VLOOKUP(BF20,Tables!E$5:F$100,2,FALSE)))","v":5}," Cd 57.0-0.0"," Cd 57.0",0,"57.0",{"$f":"IF($AZ20=\"\",\"\",IF(ISERROR(BK20),0,IF(ISNA(VLOOKUP(BJ20,Tables!G$5:H$100,2,FALSE)),\"0\",VLOOKUP(BJ20,Tables!G23:H$100,2,FALSE))))","v":3},{"$f":"IF($AZ20=\"\",\"\",Form!G23)","v":0},16,{"$f":"IF($AZ20=\"\",\"\",IF(ISNA(VLOOKUP(BN20,Tables!I$5:J$100,2,FALSE)),\"0\",VLOOKUP(BN20,Tables!I$5:J$100,2,FALSE)))","v":0},{"$f":"IF($AZ20=\"\",\"\",Form!H23)","v":0},1,{"$f":"IF($AZ20=\"\",\"\",IF(ISNA(VLOOKUP(BQ20,Tables!K$5:L$100,2,FALSE)),\"0\",VLOOKUP(BQ20,Tables!K$5:L$100,2,FALSE)))","v":8},{"$f":"IF($AZ20=\"\",\"\",Form!I23)","v":0},11,{"$f":"IF($AZ20=\"\",\"\",IF(ISNA(VLOOKUP(BT20,Tables!M$5:N$100,2,FALSE)),\"0\",VLOOKUP(BT20,Tables!M$5:N$100,2,FALSE)))","v":2},{"$f":"IF($AZ20=\"\",\"\",INDEX(Race!$D$1:$P$100,MATCH($AZ20,Race!$C$1:$C$100,0)+0,9))","v":0},"","N",{"$f":"IF($AZ20=\"\",\"\",IF(ISNA(VLOOKUP(BX20,Tables!O$5:P$100,2,FALSE)),0,VLOOKUP(BX20,Tables!O$5:P$100,2,FALSE)))","v":0},"","N",{"$f":"IF($AZ20=\"\",\"\",IF(ISNA(VLOOKUP(CA20,Tables!Q$5:R$100,2,FALSE)),0,VLOOKUP(CA20,Tables!Q$5:R$100,2,FALSE)))","v":0},"","N",{"$f":"IF($AZ20=\"\",\"\",IF(ISNA(VLOOKUP(CD20,Tables!S$5:T$100,2,FALSE)),0,VLOOKUP(CD20,Tables!S$5:T$100,2,FALSE)))","v":0},"","N",{"$f":"IF($AZ20=\"\",\"\",IF(ISNA(VLOOKUP(CG20,Tables!U$5:V$100,2,FALSE)),0,VLOOKUP(CG20,Tables!U$5:V$100,2,FALSE)))","v":0},"2010-11-02",22,22,{"$f":"IF($AZ20=\"\",\"\",IF(ISERROR(CK20),0,IF(ISNA(VLOOKUP(CK20,Tables!W$5:X$100,2,FALSE)),\"0\",VLOOKUP(CK20,Tables!W$5:X$100,2,FALSE))))","v":0},"2009-11-03",386,0,{"$f":"IF($AZ20=\"\",\"\",IF(ISERROR(CO20),0,IF(ISNA(VLOOKUP(CO20,Tables!Y$5:Z$100,2,FALSE)),\"0\",VLOOKUP(CO20,Tables!Y$5:Z$100,2,FALSE))))","v":0},"2009-10-21",399,0,{"$f":"IF($AZ20=\"\",\"\",IF(ISERROR(CS20),0,IF(ISNA(VLOOKUP(CS20,Tables!AA$5:AB$100,2,FALSE)),\"0\",VLOOKUP(CS20,Tables!AA$5:AB$100,2,FALSE))))","v":0},10000,{"$f":"IF(CU20=\"\",\"\",(Form!$H$3-CU20)/CU20*100)","v":0},3,{"$f":"IF($AZ20=\"\",\"\",IF(ISERROR(CW20),0,IF(ISNA(VLOOKUP(CW20,Tables!AC$5:AD$100,2,FALSE)),\"0\",VLOOKUP(CW20,Tables!AC$5:AD$100,2,FALSE))))","v":0},"9-13 5.5L","9",9,{"$f":"IF($AZ20=\"\",\"\",IF(ISERROR(DA20),0,IF(ISNA(VLOOKUP(DA20,Tables!AE$5:AF$100,2,FALSE)),\"0\",VLOOKUP(DA20,Tables!AE$5:AF$100,2,FALSE))))","v":0},"5.5L","5.5",5.5,5.5,5.5,{"$f":"IF($AZ20=\"\",\"\",IF(ISERROR(DG20),0,IF(ISNA(VLOOKUP(DF20,Tables!AG$5:AH$100,2,FALSE)),\"0\",VLOOKUP(DF20,Tables!AG$5:AH$100,2,FALSE))))","v":0},"12-12 15.6L","12",0,{"$f":"IF($AZ20=\"\",\"\",IF(ISERROR(DK20),0,IF(ISNA(VLOOKUP(DK20,Tables!AI$5:AJ$100,2,FALSE)),\"0\",VLOOKUP(DK20,Tables!AI$5:AJ$100,2,FALSE))))","v":0},"15.6L","15.6",15.5,15.5,15.5,{"$f":"IF($AZ20=\"\",\"\",IF(ISERROR(DQ20),0,IF(ISNA(VLOOKUP(DP20,Tables!AK$5:AL$100,2,FALSE)),\"0\",VLOOKUP(DP20,Tables!AK$5:AL$100,2,FALSE))))","v":"0"},"9-9 19.5L","9",9,{"$f":"IF($AZ20=\"\",\"\",IF(ISERROR(DU20),0,IF(ISNA(VLOOKUP(DU20,Tables!AM$5:AN$100,2,FALSE)),\"0\",VLOOKUP(DU20,Tables!AM$5:AN$100,2,FALSE))))","v":0},".5L",".5",0.5,0.5,0.5,{"$f":"IF($BB20=\"\",\"\",IF(ISERROR(EA20),0,IF(ISNA(VLOOKUP(DZ20,Tables!AO$5:AP$100,2,FALSE)),\"0\",VLOOKUP(DZ20,Tables!AO$5:AP$100,2,FALSE))))","v":7},{"$f":"IF(AZ20=\"\",\"\",VLOOKUP(AZ20,Race!$C$1:$N$100,12,FALSE))","v":0},"0",0,{"$f":"IF($BB20=\"\",\"\",IF(ISNA(VLOOKUP(EE20,Tables!AQ$5:AR$100,2,FALSE)),\"0\",VLOOKUP(EE20,Tables!AQ$5:AR$100,2,FALSE)))","v":0},{"$f":"IF(AZ20=\"\",\"\",IF(MainSheet!D27=\"Scratched\",\"\",BC20+BE20+BG20+BL20+BO20+BR20+BU20+BY20+CB20+CE20+CH20+CL20+CP20+CT20+CX20+DB20+DH20+DL20+DR20+DV20+EB20+EF20))","v":""},"",""]
[{"$f":"IF(RaceLists!A21=\"\",\"\",IF(RaceLists!A21=\"END\",\"END\",IF(RaceLists!E21=\"\",\"\",getAddress(RaceLists!E21))))","v":"http://formguide.cyberhorse.com.au/index.php/Form/form.html?formdate=2010-11-24&track=Lakesi&raceno=2"},{"$nulls":12},"",{"$f":"IF(Meetings!D21=\"\",\"\",getAddress(Meetings!D21))","v":"http://www.tabonline.com.au/2010/11/24/QG01.html"},{"$f":"IF(Meetings!E21=\"\",\"\",getAddress(Meetings!E21))","v":"http://www.tabonline.com.au/2010/11/24/QG02.html"},{"$f":"IF(Meetings!F21=\"\",\"\",getAddress(Meetings!F21))","v":"http://www.tabonline.com.au/2010/11/24/QG03.html"},{"$f":"IF(Meetings!G21=\"\",\"\",getAddress(Meetings!G21))","v":"http://www.tabonline.com.au/2010/11/24/QG04.html"},{"$f":"IF(Meetings!H21=\"\",\"\",getAddress(Meetings!H21))","v":"http://www.tabonline.com.au/2010/11/24/QG05.html"},{"$f":"IF(Meetings!I21=\"\",\"\",getAddress(Meetings!I21))","v":"http://www.tabonline.com.au/2010/11/24/QG06.html"},{"$f":"IF(Meetings!J21=\"\",\"\",getAddress(Meetings!J21))","v":"http://www.tabonline.com.au/2010/11/24/QG07.html"},{"$f":"IF(Meetings!K21=\"\",\"\",getAddress(Meetings!K21))","v":"http://www.tabonline.com.au/2010/11/24/QG08.html"},{"$f":"IF(Meetings!L21=\"\",\"\",getAddress(Meetings!L21))","v":"http://www.tabonline.com.au/2010/11/24/QG09.html"},{"$f":"IF(Meetings!M21=\"\",\"\",getAddress(Meetings!M21))","v":"http://www.tabonline.com.au/2010/11/24/QG10.html"},{"$f":"IF(Meetings!N21=\"\",\"\",getAddress(Meetings!N21))","v":""},"","1900-01-17",{"$nulls":24},{"$f":"IF(Form!I24<>\"\",LEFT(Form!C24,FIND(\"(\",Form!C24)-2),\"\")","v":""},null,{"$f":"IF(AZ21=\"\",\"\",Form!A24)","v":""},{"$f":"IF($AZ21=\"\",\"\",IF(ISNA(VLOOKUP(BB21,Tables!A$5:B$100,2,FALSE)),\"0\",VLOOKUP(BB21,Tables!A$5:B$100,2,FALSE)))","v":""},{"$f":"IF($AZ21=\"\",\"\",VLOOKUP(AZ21,Race!$C$1:$N$100,7,FALSE))","v":""},{"$f":"IF($AZ21=\"\",\"\",IF(ISNA(VLOOKUP(BD21,Tables!C$5:D$100,2,FALSE)),\"0\",VLOOKUP(BD21,Tables!C$5:D$100,2,FALSE)))","v":""},{"$f":"IF(AZ21=\"\",\"\",Form!F24)","v":""},{"$f":"IF($AZ21=\"\",\"\",IF(ISNA(VLOOKUP(BF21,Tables!E$5:F$100,2,FALSE)),\"0\",VLOOKUP(BF21,Tables!E$5:F$100,2,FALSE)))","v":""},"","","","",{"$f":"IF($AZ21=\"\",\"\",IF(ISERROR(BK21),0,IF(ISNA(VLOOKUP(BJ21,Tables!G$5:H$100,2,FALSE)),\"0\",VLOOKUP(BJ21,Tables!G24:H$100,2,FALSE))))","v":""},{"$f":"IF($AZ21=\"\",\"\",Form!G24)","v":""},"",{"$f":"IF($AZ21=\"\",\"\",IF(ISNA(VLOOKUP(BN21,Tables!I$5:J$100,2,FALSE)),\"0\",VLOOKUP(BN21,Tables!I$5:J$100,2,FALSE)))","v":""},{"$f":"IF($AZ21=\"\",\"\",Form!H24)","v":""},"",{"$f":"IF($AZ21=\"\",\"\",IF(ISNA(VLOOKUP(BQ21,Tables!K$5:L$100,2,FALSE)),\"0\",VLOOKUP(BQ21,Tables!K$5:L$100,2,FALSE)))","v":""},{"$f":"IF($AZ21=\"\",\"\",Form!I24)","v":""},"",{"$f":"IF($AZ21=\"\",\"\",IF(ISNA(VLOOKUP(BT21,Tables!M$5:N$100,2,FALSE)),\"0\",VLOOKUP(BT21,Tables!M$5:N$100,2,FALSE)))","v":""},{"$f":"IF($AZ21=\"\",\"\",INDEX(Race!$D$1:$P$100,MATCH($AZ21,Race!$C$1:$C$100,0)+0,9))","v":""},"","N",{"$f":"IF($AZ21=\"\",\"\",IF(ISNA(VLOOKUP(BX21,Tables!O$5:P$100,2,FALSE)),0,VLOOKUP(BX21,Tables!O$5:P$100,2,FALSE)))","v":""},"","N",{"$f":"IF($AZ21=\"\",\"\",IF(ISNA(VLOOKUP(CA21,Tables!Q$5:R$100,2,FALSE)),0,VLOOKUP(CA21,Tables!Q$5:R$100,2,FALSE)))","v":""},"","N",{"$f":"IF($AZ21=\"\",\"\",IF(ISNA(VLOOKUP(CD21,Tables!S$5:T$100,2,FALSE)),0,VLOOKUP(CD21,Tables!S$5:T$100,2,FALSE)))","v":""},"","N",{"$f":"IF($AZ21=\"\",\"\",IF(ISNA(VLOOKUP(CG21,Tables!U$5:V$100,2,FALSE)),0,VLOOKUP(CG21,Tables!U$5:V$100,2,FALSE)))","v":""},"","",0,{"$f":"IF($AZ21=\"\",\"\",IF(ISERROR(CK21),0,IF(ISNA(VLOOKUP(CK21,Tables!W$5:X$100,2,FALSE)),\"0\",VLOOKUP(CK21,Tables!W$5:X$100,2,FALSE))))","v":""},"","",0,{"$f":"IF($AZ21=\"\",\"\",IF(ISERROR(CO21),0,IF(ISNA(VLOOKUP(CO21,Tables!Y$5:Z$100,2,FALSE)),\"0\",VLOOKUP(CO21,Tables!Y$5:Z$100,2,FALSE))))","v":""},"","",0,{"$f":"IF($AZ21=\"\",\"\",IF(ISERROR(CS21),0,IF(ISNA(VLOOKUP(CS21,Tables!AA$5:AB$100,2,FALSE)),\"0\",VLOOKUP(CS21,Tables!AA$5:AB$100,2,FALSE))))","v":""},"",{"$f":"IF(CU21=\"\",\"\",(Form!$H$3-CU21)/CU21*100)","v":""},"",{"$f":"IF($AZ21=\"\",\"\",IF(ISERROR(CW21),0,IF(ISNA(VLOOKUP(CW21,Tables!AC$5:AD$100,2,FALSE)),\"0\",VLOOKUP(CW21,Tables!AC$5:AD$100,2,FALSE))))","v":""},"","","",{"$f":"IF($AZ21=\"\",\"\",IF(ISERROR(DA21),0,IF(ISNA(VLOOKUP(DA21,Tables!AE$5:AF$100,2,FALSE)),\"0\",VLOOKUP(DA21,Tables!AE$5:AF$100,2,FALSE))))","v":""},"","","","","",{"$f":"IF($AZ21=\"\",\"\",IF(ISERROR(DG21),0,IF(ISNA(VLOOKUP(DF21,Tables!AG$5:AH$100,2,FALSE)),\"0\",VLOOKUP(DF21,Tables!AG$5:AH$100,2,FALSE))))","v":""},"","","",{"$f":"IF($AZ21=\"\",\"\",IF(ISERROR(DK21),0,IF(ISNA(VLOOKUP(DK21,Tables!AI$5:AJ$100,2,FALSE)),\"0\",VLOOKUP(DK21,Tables!AI$5:AJ$100,2,FALSE))))","v":""},"","","","","",{"$f":"IF($AZ21=\"\",\"\",IF(ISERROR(DQ21),0,IF(ISNA(VLOOKUP(DP21,Tables!AK$5:AL$100,2,FALSE)),\"0\",VLOOKUP(DP21,Tables!AK$5:AL$100,2,FALSE))))","v":""},"","","",{"$f":"IF($AZ21=\"\",\"\",IF(ISERROR(DU21),0,IF(ISNA(VLOOKUP(DU21,Tables!AM$5:AN$100,2,FALSE)),\"0\",VLOOKUP(DU21,Tables!AM$5:AN$100,2,FALSE))))","v":""},"","","","","",{"$f":"IF($BB21=\"\",\"\",IF(ISERROR(EA21),0,IF(ISNA(VLOOKUP(DZ21,Tables!AO$5:AP$100,2,FALSE)),\"0\",VLOOKUP(DZ21,Tables!AO$5:AP$100,2,FALSE))))","v":""},{"$f":"IF(AZ21=\"\",\"\",VLOOKUP(AZ21,Race!$C$1:$N$100,12,FALSE))","v":""},"","",{"$f":"IF($BB21=\"\",\"\",IF(ISNA(VLOOKUP(EE21,Tables!AQ$5:AR$100,2,FALSE)),\"0\",VLOOKUP(EE21,Tables!AQ$5:AR$100,2,FALSE)))","v":""},{"$f":"IF(AZ21=\"\",\"\",IF(MainSheet!D28=\"Scratched\",\"\",BC21+BE21+BG21+BL21+BO21+BR21+BU21+BY21+CB21+CE21+CH21+CL21+CP21+CT21+CX21+DB21+DH21+DL21+DR21+DV21+EB21+EF21))","v":""},"",""]
[{"$f":"IF(RaceLists!A22=\"\",\"\",IF(RaceLists!A22=\"END\",\"END\",IF(RaceLists!E22=\"\",\"\",getAddress(RaceLists!E22))))","v":"http://formguide.cyberhorse.com.au/index.php/Form/form.html?formdate=2010-11-24&track=Lakesi&raceno=3"},{"$nulls":12},"",{"$f":"IF(Meetings!D22=\"\",\"\",getAddress(Meetings!D22))","v":"http://www.tabonline.com.au/2010/11/24/NG01.html"},{"$f":"IF(Meetings!E22=\"\",\"\",getAddress(Meetings!E22))","v":"http://www.tabonline.com.au/2010/11/24/NG02.html"},{"$f":"IF(Meetings!F22=\"\",\"\",getAddress(Meetings!F22))","v":"http://www.tabonline.com.au/2010/11/24/NG03.html"},{"$f":"IF(Meetings!G22=\"\",\"\",getAddress(Meetings!G22))","v":"http://www.tabonline.com.au/2010/11/24/NG04.html"},{"$f":"IF(Meetings!H22=\"\",\"\",getAddress(Meetings!H22))","v":"http://www.tabonline.com.au/2010/11/24/NG05.html"},{"$f":"IF(Meetings!I22=\"\",\"\",getAddress(Meetings!I22))","v":"http://www.tabonline.com.au/2010/11/24/NG06.html"},{"$f":"IF(Meetings!J22=\"\",\"\",getAddress(Meetings!J22))","v":"http://www.tabonline.com.au/2010/11/24/NG07.html"},{"$f":"IF(Meetings!K22=\"\",\"\",getAddress(Meetings!K22))","v":"http://www.tabonline.com.au/2010/11/24/NG08.html"},{"$f":"IF(Meetings!L22=\"\",\"\",getAddress(Meetings!L22))","v":"http://www.tabonline.com.au/2010/11/24/NG09.html"},{"$f":"IF(Meetings!M22=\"\",\"\",getAddress(Meetings!M22))","v":"http://www.tabonline.com.au/2010/11/24/NG10.html"},{"$f":"IF(Meetings!N22=\"\",\"\",getAddress(Meetings!N22))","v":""},"","1900-01-18",{"$nulls":24},{"$f":"IF(Form!I25<>\"\",LEFT(Form!C25,FIND(\"(\",Form!C25)-2),\"\")","v":""},null,{"$f":"IF(AZ22=\"\",\"\",Form!A25)","v":""},{"$f":"IF($AZ22=\"\",\"\",IF(ISNA(VLOOKUP(BB22,Tables!A$5:B$100,2,FALSE)),\"0\",VLOOKUP(BB22,Tables!A$5:B$100,2,FALSE)))","v":""},{"$f":"IF($AZ22=\"\",\"\",VLOOKUP(AZ22,Race!$C$1:$N$100,7,FALSE))","v":""},{"$f":"IF($AZ22=\"\",\"\",IF(ISNA(VLOOKUP(BD22,Tables!C$5:D$100,2,FALSE)),\"0\",VLOOKUP(BD22,Tables!C$5:D$100,2,FALSE)))","v":""},{"$f":"IF(AZ22=\"\",\"\",Form!F25)","v":""},{"$f":"IF($AZ22=\"\",\"\",IF(ISNA(VLOOKUP(BF22,Tables!E$5:F$100,2,FALSE)),\"0\",VLOOKUP(BF22,Tables!E$5:F$100,2,FALSE)))","v":""},"","","","",{"$f":"IF($AZ22=\"\",\"\",IF(ISERROR(BK22),0,IF(ISNA(VLOOKUP(BJ22,Tables!G$5:H$100,2,FALSE)),\"0\",VLOOKUP(BJ22,Tables!G25:H$100,2,FALSE))))","v":""},{"$f":"IF($AZ22=\"\",\"\",Form!G25)","v":""},"",{"$f":"IF($AZ22=\"\",\"\",IF(ISNA(VLOOKUP(BN22,Tables!I$5:J$100,2,FALSE)),\"0\",VLOOKUP(BN22,Tables!I$5:J$100,2,FALSE)))","v":""},{"$f":"IF($AZ22=\"\",\"\",Form!H25)","v":""},"",{"$f":"IF($AZ22=\"\",\"\",IF(ISNA(VLOOKUP(BQ22,Tables!K$5:L$100,2,FALSE)),\"0\",VLOOKUP(BQ22,Tables!K$5:L$100,2,FALSE)))","v":""},{"$f":"IF($AZ22=\"\",\"\",Form!I25)","v":""},"",{"$f":"IF($AZ22=\"\",\"\",IF(ISNA(VLOOKUP(BT22,Tables!M$5:N$100,2,FALSE)),\"0\",VLOOKUP(BT22,Tables!M$5:N$100,2,FALSE)))","v":""},{"$f":"IF($AZ22=\"\",\"\",INDEX(Race!$D$1:$P$100,MATCH($AZ22,Race!$C$1:$C$100,0)+0,9))","v":""},"","N",{"$f":"IF($AZ22=\"\",\"\",IF(ISNA(VLOOKUP(BX22,Tables!O$5:P$100,2,FALSE)),0,VLOOKUP(BX22,Tables!O$5:P$100,2,FALSE)))","v":""},"","N",{"$f":"IF($AZ22=\"\",\"\",IF(ISNA(VLOOKUP(CA22,Tables!Q$5:R$100,2,FALSE)),0,VLOOKUP(CA22,Tables!Q$5:R$100,2,FALSE)))","v":""},"","N",{"$f":"IF($AZ22=\"\",\"\",IF(ISNA(VLOOKUP(CD22,Tables!S$5:T$100,2,FALSE)),0,VLOOKUP(CD22,Tables!S$5:T$100,2,FALSE)))","v":""},"","N",{"$f":"IF($AZ22=\"\",\"\",IF(ISNA(VLOOKUP(CG22,Tables!U$5:V$100,2,FALSE)),0,VLOOKUP(CG22,Tables!U$5:V$100,2,FALSE)))","v":""},"","",0,{"$f":"IF($AZ22=\"\",\"\",IF(ISERROR(CK22),0,IF(ISNA(VLOOKUP(CK22,Tables!W$5:X$100,2,FALSE)),\"0\",VLOOKUP(CK22,Tables!W$5:X$100,2,FALSE))))","v":""},"","",0,{"$f":"IF($AZ22=\"\",\"\",IF(ISERROR(CO22),0,IF(ISNA(VLOOKUP(CO22,Tables!Y$5:Z$100,2,FALSE)),\"0\",VLOOKUP(CO22,Tables!Y$5:Z$100,2,FALSE))))","v":""},"","",0,{"$f":"IF($AZ22=\"\",\"\",IF(ISERROR(CS22),0,IF(ISNA(VLOOKUP(CS22,Tables!AA$5:AB$100,2,FALSE)),\"0\",VLOOKUP(CS22,Tables!AA$5:AB$100,2,FALSE))))","v":""},"",{"$f":"IF(CU22=\"\",\"\",(Form!$H$3-CU22)/CU22*100)","v":""},"",{"$f":"IF($AZ22=\"\",\"\",IF(ISERROR(CW22),0,IF(ISNA(VLOOKUP(CW22,Tables!AC$5:AD$100,2,FALSE)),\"0\",VLOOKUP(CW22,Tables!AC$5:AD$100,2,FALSE))))","v":""},"","","",{"$f":"IF($AZ22=\"\",\"\",IF(ISERROR(DA22),0,IF(ISNA(VLOOKUP(DA22,Tables!AE$5:AF$100,2,FALSE)),\"0\",VLOOKUP(DA22,Tables!AE$5:AF$100,2,FALSE))))","v":""},"","","","","",{"$f":"IF($AZ22=\"\",\"\",IF(ISERROR(DG22),0,IF(ISNA(VLOOKUP(DF22,Tables!AG$5:AH$100,2,FALSE)),\"0\",VLOOKUP(DF22,Tables!AG$5:AH$100,2,FALSE))))","v":""},"","","",{"$f":"IF($AZ22=\"\",\"\",IF(ISERROR(DK22),0,IF(ISNA(VLOOKUP(DK22,Tables!AI$5:AJ$100,2,FALSE)),\"0\",VLOOKUP(DK22,Tables!AI$5:AJ$100,2,FALSE))))","v":""},"","","","","",{"$f":"IF($AZ22=\"\",\"\",IF(ISERROR(DQ22),0,IF(ISNA(VLOOKUP(DP22,Tables!AK$5:AL$100,2,FALSE)),\"0\",VLOOKUP(DP22,Tables!AK$5:AL$100,2,FALSE))))","v":""},"","","",{"$f":"IF($AZ22=\"\",\"\",IF(ISERROR(DU22),0,IF(ISNA(VLOOKUP(DU22,Tables!AM$5:AN$100,2,FALSE)),\"0\",VLOOKUP(DU22,Tables!AM$5:AN$100,2,FALSE))))","v":""},"","","","","",{"$f":"IF($BB22=\"\",\"\",IF(ISERROR(EA22),0,IF(ISNA(VLOOKUP(DZ22,Tables!AO$5:AP$100,2,FALSE)),\"0\",VLOOKUP(DZ22,Tables!AO$5:AP$100,2,FALSE))))","v":""},{"$f":"IF(AZ22=\"\",\"\",VLOOKUP(AZ22,Race!$C$1:$N$100,12,FALSE))","v":""},"","",{"$f":"IF($BB22=\"\",\"\",IF(ISNA(VLOOKUP(EE22,Tables!AQ$5:AR$100,2,FALSE)),\"0\",VLOOKUP(EE22,Tables!AQ$5:AR$100,2,FALSE)))","v":""},{"$f":"IF(AZ22=\"\",\"\",IF(MainSheet!D29=\"Scratched\",\"\",BC22+BE22+BG22+BL22+BO22+BR22+BU22+BY22+CB22+CE22+CH22+CL22+CP22+CT22+CX22+DB22+DH22+DL22+DR22+DV22+EB22+EF22))","v":""},"",""]
[{"$f":"IF(RaceLists!A23=\"\",\"\",IF(RaceLists!A23=\"END\",\"END\",IF(RaceLists!E23=\"\",\"\",getAddress(RaceLists!E23))))","v":"http://formguide.cyberhorse.com.au/index.php/Form/form.html?formdate=2010-11-24&track=Lakesi&raceno=4"},{"$nulls":12},"",{"$f":"IF(Meetings!D23=\"\",\"\",getAddress(Meetings!D23))","v":"http://www.tabonline.com.au/2010/11/24/VG01.html"},{"$f":"IF(Meetings!E23=\"\",\"\",getAddress(Meetings!E23))","v":"http://www.tabonline.com.au/2010/11/24/VG02.html"},{"$f":"IF(Meetings!F23=\"\",\"\",getAddress(Meetings!F23))","v":"http://www.tabonline.com.au/2010/11/24/VG03.html"},{"$f":"IF(Meetings!G23=\"\",\"\",getAddress(Meetings!G23))","v":"http://www.tabonline.com.au/2010/11/24/VG04.html"},{"$f":"IF(Meetings!H23=\"\",\"\",getAddress(Meetings!H23))","v":"http://www.tabonline.com.au/2010/11/24/VG05.html"},{"$f":"IF(Meetings!I23=\"\",\"\",getAddress(Meetings!I23))","v":"http://www.tabonline.com.au/2010/11/24/VG06.html"},{"$f":"IF(Meetings!J23=\"\",\"\",getAddress(Meetings!J23))","v":"http://www.tabonline.com.au/2010/11/24/VG07.html"},{"$f":"IF(Meetings!K23=\"\",\"\",getAddress(Meetings!K23))","v":"http://www.tabonline.com.au/2010/11/24/VG08.html"},{"$f":"IF(Meetings!L23=\"\",\"\",getAddress(Meetings!L23))","v":"http://www.tabonline.com.au/2010/11/24/VG09.html"},{"$f":"IF(Meetings!M23=\"\",\"\",getAddress(Meetings!M23))","v":"http://www.tabonline.com.au/2010/11/24/VG10.html"},{"$f":"IF(Meetings!N23=\"\",\"\",getAddress(Meetings!N23))","v":"http://www.tabonline.com.au/2010/11/24/VG11.html"},"",18,{"$nulls":24},{"$f":"IF(Form!I26<>\"\",LEFT(Form!C26,FIND(\"(\",Form!C26)-2),\"\")","v":""},null,{"$f":"IF(AZ23=\"\",\"\",Form!A26)","v":""},{"$f":"IF($AZ23=\"\",\"\",IF(ISNA(VLOOKUP(BB23,Tables!A$5:B$100,2,FALSE)),\"0\",VLOOKUP(BB23,Tables!A$5:B$100,2,FALSE)))","v":""},{"$f":"IF($AZ23=\"\",\"\",VLOOKUP(AZ23,Race!$C$1:$N$100,7,FALSE))","v":""},{"$f":"IF($AZ23=\"\",\"\",IF(ISNA(VLOOKUP(BD23,Tables!C$5:D$100,2,FALSE)),\"0\",VLOOKUP(BD23,Tables!C$5:D$100,2,FALSE)))","v":""},{"$f":"IF(AZ23=\"\",\"\",Form!F26)","v":""},{"$f":"IF($AZ23=\"\",\"\",IF(ISNA(VLOOKUP(BF23,Tables!E$5:F$100,2,FALSE)),\"0\",VLOOKUP(BF23,Tables!E$5:F$100,2,FALSE)))","v":""},"","","","",{"$f":"IF($AZ23=\"\",\"\",IF(ISERROR(BK23),0,IF(ISNA(VLOOKUP(BJ23,Tables!G$5:H$100,2,FALSE)),\"0\",VLOOKUP(BJ23,Tables!G26:H$100,2,FALSE))))","v":""},{"$f":"IF($AZ23=\"\",\"\",Form!G26)","v":""},"",{"$f":"IF($AZ23=\"\",\"\",IF(ISNA(VLOOKUP(BN23,Tables!I$5:J$100,2,FALSE)),\"0\",VLOOKUP(BN23,Tables!I$5:J$100,2,FALSE)))","v":""},{"$f":"IF($AZ23=\"\",\"\",Form!H26)","v":""},"",{"$f":"IF($AZ23=\"\",\"\",IF(ISNA(VLOOKUP(BQ23,Tables!K$5:L$100,2,FALSE)),\"0\",VLOOKUP(BQ23,Tables!K$5:L$100,2,FALSE)))","v":""},{"$f":"IF($AZ23=\"\",\"\",Form!I26)","v":""},"",{"$f":"IF($AZ23=\"\",\"\",IF(ISNA(VLOOKUP(BT23,Tables!M$5:N$100,2,FALSE)),\"0\",VLOOKUP(BT23,Tables!M$5:N$100,2,FALSE)))","v":""},{"$f":"IF($AZ23=\"\",\"\",INDEX(Race!$D$1:$P$100,MATCH($AZ23,Race!$C$1:$C$100,0)+0,9))","v":""},"","N",{"$f":"IF($AZ23=\"\",\"\",IF(ISNA(VLOOKUP(BX23,Tables!O$5:P$100,2,FALSE)),0,VLOOKUP(BX23,Tables!O$5:P$100,2,FALSE)))","v":""},"","N",{"$f":"IF($AZ23=\"\",\"\",IF(ISNA(VLOOKUP(CA23,Tables!Q$5:R$100,2,FALSE)),0,VLOOKUP(CA23,Tables!Q$5:R$100,2,FALSE)))","v":""},"","N",{"$f":"IF($AZ23=\"\",\"\",IF(ISNA(VLOOKUP(CD23,Tables!S$5:T$100,2,FALSE)),0,VLOOKUP(CD23,Tables!S$5:T$100,2,FALSE)))","v":""},"","N",{"$f":"IF($AZ23=\"\",\"\",IF(ISNA(VLOOKUP(CG23,Tables!U$5:V$100,2,FALSE)),0,VLOOKUP(CG23,Tables!U$5:V$100,2,FALSE)))","v":""},"","",0,{"$f":"IF($AZ23=\"\",\"\",IF(ISERROR(CK23),0,IF(ISNA(VLOOKUP(CK23,Tables!W$5:X$100,2,FALSE)),\"0\",VLOOKUP(CK23,Tables!W$5:X$100,2,FALSE))))","v":""},"","",0,{"$f":"IF($AZ23=\"\",\"\",IF(ISERROR(CO23),0,IF(ISNA(VLOOKUP(CO23,Tables!Y$5:Z$100,2,FALSE)),\"0\",VLOOKUP(CO23,Tables!Y$5:Z$100,2,FALSE))))","v":""},"","",0,{"$f":"IF($AZ23=\"\",\"\",IF(ISERROR(CS23),0,IF(ISNA(VLOOKUP(CS23,Tables!AA$5:AB$100,2,FALSE)),\"0\",VLOOKUP(CS23,Tables!AA$5:AB$100,2,FALSE))))","v":""},"",{"$f":"IF(CU23=\"\",\"\",(Form!$H$3-CU23)/CU23*100)","v":""},"",{"$f":"IF($AZ23=\"\",\"\",IF(ISERROR(CW23),0,IF(ISNA(VLOOKUP(CW23,Tables!AC$5:AD$100,2,FALSE)),\"0\",VLOOKUP(CW23,Tables!AC$5:AD$100,2,FALSE))))","v":""},"","","",{"$f":"IF($AZ23=\"\",\"\",IF(ISERROR(DA23),0,IF(ISNA(VLOOKUP(DA23,Tables!AE$5:AF$100,2,FALSE)),\"0\",VLOOKUP(DA23,Tables!AE$5:AF$100,2,FALSE))))","v":""},"","","","","",{"$f":"IF($AZ23=\"\",\"\",IF(ISERROR(DG23),0,IF(ISNA(VLOOKUP(DF23,Tables!AG$5:AH$100,2,FALSE)),\"0\",VLOOKUP(DF23,Tables!AG$5:AH$100,2,FALSE))))","v":""},"","","",{"$f":"IF($AZ23=\"\",\"\",IF(ISERROR(DK23),0,IF(ISNA(VLOOKUP(DK23,Tables!AI$5:AJ$100,2,FALSE)),\"0\",VLOOKUP(DK23,Tables!AI$5:AJ$100,2,FALSE))))","v":""},"","","","","",{"$f":"IF($AZ23=\"\",\"\",IF(ISERROR(DQ23),0,IF(ISNA(VLOOKUP(DP23,Tables!AK$5:AL$100,2,FALSE)),\"0\",VLOOKUP(DP23,Tables!AK$5:AL$100,2,FALSE))))","v":""},"","","",{"$f":"IF($AZ23=\"\",\"\",IF(ISERROR(DU23),0,IF(ISNA(VLOOKUP(DU23,Tables!AM$5:AN$100,2,FALSE)),\"0\",VLOOKUP(DU23,Tables!AM$5:AN$100,2,FALSE))))","v":""},"","","","","",{"$f":"IF($BB23=\"\",\"\",IF(ISERROR(EA23),0,IF(ISNA(VLOOKUP(DZ23,Tables!AO$5:AP$100,2,FALSE)),\"0\",VLOOKUP(DZ23,Tables!AO$5:AP$100,2,FALSE))))","v":""},{"$f":"IF(AZ23=\"\",\"\",VLOOKUP(AZ23,Race!$C$1:$N$100,12,FALSE))","v":""},"","",{"$f":"IF($BB23=\"\",\"\",IF(ISNA(VLOOKUP(EE23,Tables!AQ$5:AR$100,2,FALSE)),\"0\",VLOOKUP(EE23,Tables!AQ$5:AR$100,2,FALSE)))","v":""},{"$f":"IF(AZ23=\"\",\"\",IF(MainSheet!D30=\"Scratched\",\"\",BC23+BE23+BG23+BL23+BO23+BR23+BU23+BY23+CB23+CE23+CH23+CL23+CP23+CT23+CX23+DB23+DH23+DL23+DR23+DV23+EB23+EF23))","v":""},"",""]
[{"$f":"IF(RaceLists!A24=\"\",\"\",IF(RaceLists!A24=\"END\",\"END\",IF(RaceLists!E24=\"\",\"\",getAddress(RaceLists!E24))))","v":"http://formguide.cyberhorse.com.au/index.php/Form/form.html?formdate=2010-11-24&track=Lakesi&raceno=5"},{"$nulls":12},"",{"$nulls":37},{"$f":"IF(Form!I27<>\"\",LEFT(Form!C27,FIND(\"(\",Form!C27)-2),\"\")","v":""},null,{"$f":"IF(AZ24=\"\",\"\",Form!A27)","v":""},{"$f":"IF($AZ24=\"\",\"\",IF(ISNA(VLOOKUP(BB24,Tables!A$5:B$100,2,FALSE)),\"0\",VLOOKUP(BB24,Tables!A$5:B$100,2,FALSE)))","v":""},{"$f":"IF($AZ24=\"\",\"\",VLOOKUP(AZ24,Race!$C$1:$N$100,7,FALSE))","v":""},{"$f":"IF($AZ24=\"\",\"\",IF(ISNA(VLOOKUP(BD24,Tables!C$5:D$100,2,FALSE)),\"0\",VLOOKUP(BD24,Tables!C$5:D$100,2,FALSE)))","v":""},{"$f":"IF(AZ24=\"\",\"\",Form!F27)","v":""},{"$f":"IF($AZ24=\"\",\"\",IF(ISNA(VLOOKUP(BF24,Tables!E$5:F$100,2,FALSE)),\"0\",VLOOKUP(BF24,Tables!E$5:F$100,2,FALSE)))","v":""},"","","","",{"$f":"IF($AZ24=\"\",\"\",IF(ISERROR(BK24),0,IF(ISNA(VLOOKUP(BJ24,Tables!G$5:H$100,2,FALSE)),\"0\",VLOOKUP(BJ24,Tables!G27:H$100,2,FALSE))))","v":""},{"$f":"IF($AZ24=\"\",\"\",Form!G27)","v":""},"",{"$f":"IF($AZ24=\"\",\"\",IF(ISNA(VLOOKUP(BN24,Tables!I$5:J$100,2,FALSE)),\"0\",VLOOKUP(BN24,Tables!I$5:J$100,2,FALSE)))","v":""},{"$f":"IF($AZ24=\"\",\"\",Form!H27)","v":""},"",{"$f":"IF($AZ24=\"\",\"\",IF(ISNA(VLOOKUP(BQ24,Tables!K$5:L$100,2,FALSE)),\"0\",VLOOKUP(BQ24,Tables!K$5:L$100,2,FALSE)))","v":""},{"$f":"IF($AZ24=\"\",\"\",Form!I27)","v":""},"",{"$f":"IF($AZ24=\"\",\"\",IF(ISNA(VLOOKUP(BT24,Tables!M$5:N$100,2,FALSE)),\"0\",VLOOKUP(BT24,Tables!M$5:N$100,2,FALSE)))","v":""},{"$f":"IF($AZ24=\"\",\"\",INDEX(Race!$D$1:$P$100,MATCH($AZ24,Race!$C$1:$C$100,0)+0,9))","v":""},"","N",{"$f":"IF($AZ24=\"\",\"\",IF(ISNA(VLOOKUP(BX24,Tables!O$5:P$100,2,FALSE)),0,VLOOKUP(BX24,Tables!O$5:P$100,2,FALSE)))","v":""},"","N",{"$f":"IF($AZ24=\"\",\"\",IF(ISNA(VLOOKUP(CA24,Tables!Q$5:R$100,2,FALSE)),0,VLOOKUP(CA24,Tables!Q$5:R$100,2,FALSE)))","v":""},"","N",{"$f":"IF($AZ24=\"\",\"\",IF(ISNA(VLOOKUP(CD24,Tables!S$5:T$100,2,FALSE)),0,VLOOKUP(CD24,Tables!S$5:T$100,2,FALSE)))","v":""},"","N",{"$f":"IF($AZ24=\"\",\"\",IF(ISNA(VLOOKUP(CG24,Tables!U$5:V$100,2,FALSE)),0,VLOOKUP(CG24,Tables!U$5:V$100,2,FALSE)))","v":""},"","",0,{"$f":"IF($AZ24=\"\",\"\",IF(ISERROR(CK24),0,IF(ISNA(VLOOKUP(CK24,Tables!W$5:X$100,2,FALSE)),\"0\",VLOOKUP(CK24,Tables!W$5:X$100,2,FALSE))))","v":""},"","",0,{"$f":"IF($AZ24=\"\",\"\",IF(ISERROR(CO24),0,IF(ISNA(VLOOKUP(CO24,Tables!Y$5:Z$100,2,FALSE)),\"0\",VLOOKUP(CO24,Tables!Y$5:Z$100,2,FALSE))))","v":""},"","",0,{"$f":"IF($AZ24=\"\",\"\",IF(ISERROR(CS24),0,IF(ISNA(VLOOKUP(CS24,Tables!AA$5:AB$100,2,FALSE)),\"0\",VLOOKUP(CS24,Tables!AA$5:AB$100,2,FALSE))))","v":""},"",{"$f":"IF(CU24=\"\",\"\",(Form!$H$3-CU24)/CU24*100)","v":""},"",{"$f":"IF($AZ24=\"\",\"\",IF(ISERROR(CW24),0,IF(ISNA(VLOOKUP(CW24,Tables!AC$5:AD$100,2,FALSE)),\"0\",VLOOKUP(CW24,Tables!AC$5:AD$100,2,FALSE))))","v":""},"","","",{"$f":"IF($AZ24=\"\",\"\",IF(ISERROR(DA24),0,IF(ISNA(VLOOKUP(DA24,Tables!AE$5:AF$100,2,FALSE)),\"0\",VLOOKUP(DA24,Tables!AE$5:AF$100,2,FALSE))))","v":""},"","","","","",{"$f":"IF($AZ24=\"\",\"\",IF(ISERROR(DG24),0,IF(ISNA(VLOOKUP(DF24,Tables!AG$5:AH$100,2,FALSE)),\"0\",VLOOKUP(DF24,Tables!AG$5:AH$100,2,FALSE))))","v":""},"","","",{"$f":"IF($AZ24=\"\",\"\",IF(ISERROR(DK24),0,IF(ISNA(VLOOKUP(DK24,Tables!AI$5:AJ$100,2,FALSE)),\"0\",VLOOKUP(DK24,Tables!AI$5:AJ$100,2,FALSE))))","v":""},"","","","","",{"$f":"IF($AZ24=\"\",\"\",IF(ISERROR(DQ24),0,IF(ISNA(VLOOKUP(DP24,Tables!AK$5:AL$100,2,FALSE)),\"0\",VLOOKUP(DP24,Tables!AK$5:AL$100,2,FALSE))))","v":""},"","","",{"$f":"IF($AZ24=\"\",\"\",IF(ISERROR(DU24),0,IF(ISNA(VLOOKUP(DU24,Tables!AM$5:AN$100,2,FALSE)),\"0\",VLOOKUP(DU24,Tables!AM$5:AN$100,2,FALSE))))","v":""},"","","","","",{"$f":"IF($BB24=\"\",\"\",IF(ISERROR(EA24),0,IF(ISNA(VLOOKUP(DZ24,Tables!AO$5:AP$100,2,FALSE)),\"0\",VLOOKUP(DZ24,Tables!AO$5:AP$100,2,FALSE))))","v":""},{"$f":"IF(AZ24=\"\",\"\",VLOOKUP(AZ24,Race!$C$1:$N$100,12,FALSE))","v":""},"","",{"$f":"IF($BB24=\"\",\"\",IF(ISNA(VLOOKUP(EE24,Tables!AQ$5:AR$100,2,FALSE)),\"0\",VLOOKUP(EE24,Tables!AQ$5:AR$100,2,FALSE)))","v":""},{"$f":"IF(AZ24=\"\",\"\",IF(MainSheet!D31=\"Scratched\",\"\",BC24+BE24+BG24+BL24+BO24+BR24+BU24+BY24+CB24+CE24+CH24+CL24+CP24+CT24+CX24+DB24+DH24+DL24+DR24+DV24+EB24+EF24))","v":""},"",""]
[{"$f":"IF(RaceLists!A25=\"\",\"\",IF(RaceLists!A25=\"END\",\"END\",IF(RaceLists!E25=\"\",\"\",getAddress(RaceLists!E25))))","v":"http://formguide.cyberhorse.com.au/index.php/Form/form.html?formdate=2010-11-24&track=Lakesi&raceno=6"},{"$nulls":12},"",{"$f":"IF(Meetings!D24=\"\",\"\",getAddress(Meetings!D24))","v":"http://www.tabonline.com.au/2010/11/24/AG01.html"},{"$f":"IF(Meetings!E24=\"\",\"\",getAddress(Meetings!E24))","v":"http://www.tabonline.com.au/2010/11/24/AG02.html"},{"$f":"IF(Meetings!F24=\"\",\"\",getAddress(Meetings!F24))","v":"http://www.tabonline.com.au/2010/11/24/AG03.html"},{"$f":"IF(Meetings!G24=\"\",\"\",getAddress(Meetings!G24))","v":"http://www.tabonline.com.au/2010/11/24/AG04.html"},{"$f":"IF(Meetings!H24=\"\",\"\",getAddress(Meetings!H24))","v":"http://www.tabonline.com.au/2010/11/24/AG05.html"},{"$f":"IF(Meetings!I24=\"\",\"\",getAddress(Meetings!I24))","v":"http://www.tabonline.com.au/2010/11/24/AG06.html"},{"$f":"IF(Meetings!J24=\"\",\"\",getAddress(Meetings!J24))","v":"http://www.tabonline.com.au/2010/11/24/AG07.html"},{"$f":"IF(Meetings!K24=\"\",\"\",getAddress(Meetings!K24))","v":"http://www.tabonline.com.au/2010/11/24/AG08.html"},{"$f":"IF(Meetings!L24=\"\",\"\",getAddress(Meetings!L24))","v":"http://www.tabonline.com.au/2010/11/24/AG09.html"},{"$f":"IF(Meetings!M24=\"\",\"\",getAddress(Meetings!M24))","v":"http://www.tabonline.com.au/2010/11/24/AG10.html"},{"$f":"IF(Meetings!N24=\"\",\"\",getAddress(Meetings!N24))","v":""},{"$f":"IF(AA25=\"\",\"\",IF(ISERROR(MID(AA25,FIND(\" \",AA25,1)+1,FIND(\"(\",AA25,1)-FIND(\" \",AA25,1)-2)),\"\",MID(AA25,FIND(\" \",AA25,1)+1,FIND(\"(\",AA25,1)-FIND(\" \",AA25,1)-2)))","v":"Hoosang"},"1 Hoosang (6) 57.0kg 4yo br g",{"$nulls":24},{"$f":"IF(Form!I28<>\"\",LEFT(Form!C28,FIND(\"(\",Form!C28)-2),\"\")","v":""},null,{"$f":"IF(AZ25=\"\",\"\",Form!A28)","v":""},{"$f":"IF($AZ25=\"\",\"\",IF(ISNA(VLOOKUP(BB25,Tables!A$5:B$100,2,FALSE)),\"0\",VLOOKUP(BB25,Tables!A$5:B$100,2,FALSE)))","v":""},{"$f":"IF($AZ25=\"\",\"\",VLOOKUP(AZ25,Race!$C$1:$N$100,7,FALSE))","v":""},{"$f":"IF($AZ25=\"\",\"\",IF(ISNA(VLOOKUP(BD25,Tables!C$5:D$100,2,FALSE)),\"0\",VLOOKUP(BD25,Tables!C$5:D$100,2,FALSE)))","v":""},{"$f":"IF(AZ25=\"\",\"\",Form!F28)","v":""},{"$f":"IF($AZ25=\"\",\"\",IF(ISNA(VLOOKUP(BF25,Tables!E$5:F$100,2,FALSE)),\"0\",VLOOKUP(BF25,Tables!E$5:F$100,2,FALSE)))","v":""},"","","","",{"$f":"IF($AZ25=\"\",\"\",IF(ISERROR(BK25),0,IF(ISNA(VLOOKUP(BJ25,Tables!G$5:H$100,2,FALSE)),\"0\",VLOOKUP(BJ25,Tables!G28:H$100,2,FALSE))))","v":""},{"$f":"IF($AZ25=\"\",\"\",Form!G27)","v":""},"",{"$f":"IF($AZ25=\"\",\"\",IF(ISNA(VLOOKUP(BN25,Tables!I$5:J$100,2,FALSE)),\"0\",VLOOKUP(BN25,Tables!I$5:J$100,2,FALSE)))","v":""},{"$f":"IF($AZ25=\"\",\"\",Form!H27)","v":""},"",{"$f":"IF($AZ25=\"\",\"\",IF(ISNA(VLOOKUP(BQ25,Tables!K$5:L$100,2,FALSE)),\"0\",VLOOKUP(BQ25,Tables!K$5:L$100,2,FALSE)))","v":""},{"$f":"IF($AZ25=\"\",\"\",Form!I28)","v":""},"",{"$f":"IF($AZ25=\"\",\"\",IF(ISNA(VLOOKUP(BT25,Tables!M$5:N$100,2,FALSE)),\"0\",VLOOKUP(BT25,Tables!M$5:N$100,2,FALSE)))","v":""},{"$f":"IF($AZ25=\"\",\"\",INDEX(Race!$D$1:$P$100,MATCH($AZ25,Race!$C$1:$C$100,0)+0,9))","v":""},"","N",{"$f":"IF($AZ25=\"\",\"\",IF(ISNA(VLOOKUP(BX25,Tables!O$5:P$100,2,FALSE)),0,VLOOKUP(BX25,Tables!O$5:P$100,2,FALSE)))","v":""},"","N",{"$f":"IF($AZ25=\"\",\"\",IF(ISNA(VLOOKUP(CA25,Tables!Q$5:R$100,2,FALSE)),0,VLOOKUP(CA25,Tables!Q$5:R$100,2,FALSE)))","v":""},"","N",{"$f":"IF($AZ25=\"\",\"\",IF(ISNA(VLOOKUP(CD25,Tables!S$5:T$100,2,FALSE)),0,VLOOKUP(CD25,Tables!S$5:T$100,2,FALSE)))","v":""},"","N",{"$f":"IF($AZ25=\"\",\"\",IF(ISNA(VLOOKUP(CG25,Tables!U$5:V$100,2,FALSE)),0,VLOOKUP(CG25,Tables!U$5:V$100,2,FALSE)))","v":""},"","",0,{"$f":"IF($AZ25=\"\",\"\",IF(ISERROR(CK25),0,IF(ISNA(VLOOKUP(CK25,Tables!W$5:X$100,2,FALSE)),\"0\",VLOOKUP(CK25,Tables!W$5:X$100,2,FALSE))))","v":""},"","",0,{"$f":"IF($AZ25=\"\",\"\",IF(ISERROR(CO25),0,IF(ISNA(VLOOKUP(CO25,Tables!Y$5:Z$100,2,FALSE)),\"0\",VLOOKUP(CO25,Tables!Y$5:Z$100,2,FALSE))))","v":""},"","",0,{"$f":"IF($AZ25=\"\",\"\",IF(ISERROR(CS25),0,IF(ISNA(VLOOKUP(CS25,Tables!AA$5:AB$100,2,FALSE)),\"0\",VLOOKUP(CS25,Tables!AA$5:AB$100,2,FALSE))))","v":""},"",{"$f":"IF(CU25=\"\",\"\",(Form!$H$3-CU25)/CU25*100)","v":""},"",{"$f":"IF($AZ25=\"\",\"\",IF(ISERROR(CW25),0,IF(ISNA(VLOOKUP(CW25,Tables!AC$5:AD$100,2,FALSE)),\"0\",VLOOKUP(CW25,Tables!AC$5:AD$100,2,FALSE))))","v":""},"","","",{"$f":"IF($AZ25=\"\",\"\",IF(ISERROR(DA25),0,IF(ISNA(VLOOKUP(DA25,Tables!AE$5:AF$100,2,FALSE)),\"0\",VLOOKUP(DA25,Tables!AE$5:AF$100,2,FALSE))))","v":""},"","","","","",{"$f":"IF($AZ25=\"\",\"\",IF(ISERROR(DG25),0,IF(ISNA(VLOOKUP(DF25,Tables!AG$5:AH$100,2,FALSE)),\"0\",VLOOKUP(DF25,Tables!AG$5:AH$100,2,FALSE))))","v":""},"","","",{"$f":"IF($AZ25=\"\",\"\",IF(ISERROR(DK25),0,IF(ISNA(VLOOKUP(DK25,Tables!AI$5:AJ$100,2,FALSE)),\"0\",VLOOKUP(DK25,Tables!AI$5:AJ$100,2,FALSE))))","v":""},"","","","","",{"$f":"IF($AZ25=\"\",\"\",IF(ISERROR(DQ25),0,IF(ISNA(VLOOKUP(DP25,Tables!AK$5:AL$100,2,FALSE)),\"0\",VLOOKUP(DP25,Tables!AK$5:AL$100,2,FALSE))))","v":""},"","","",{"$f":"IF($AZ25=\"\",\"\",IF(ISERROR(DU25),0,IF(ISNA(VLOOKUP(DU25,Tables!AM$5:AN$100,2,FALSE)),\"0\",VLOOKUP(DU25,Tables!AM$5:AN$100,2,FALSE))))","v":""},"","","","","",{"$f":"IF($BB25=\"\",\"\",IF(ISERROR(EA25),0,IF(ISNA(VLOOKUP(DZ25,Tables!AO$5:AP$100,2,FALSE)),\"0\",VLOOKUP(DZ25,Tables!AO$5:AP$100,2,FALSE))))","v":""},{"$f":"IF(AZ25=\"\",\"\",VLOOKUP(AZ25,Race!$C$1:$N$100,12,FALSE))","v":""},"","",{"$f":"IF($BB25=\"\",\"\",IF(ISNA(VLOOKUP(EE25,Tables!AQ$5:AR$100,2,FALSE)),\"0\",VLOOKUP(EE25,Tables!AQ$5:AR$100,2,FALSE)))","v":""},{"$f":"IF(AZ25=\"\",\"\",IF(MainSheet!D32=\"Scratched\",\"\",BC25+BE25+BG25+BL25+BO25+BR25+BU25+BY25+CB25+CE25+CH25+CL25+CP25+CT25+CX25+DB25+DH25+DL25+DR25+DV25+EB25+EF25))","v":""},"",""]
[{"$f":"IF(RaceLists!A26=\"\",\"\",IF(RaceLists!A26=\"END\",\"END\",IF(RaceLists!E26=\"\",\"\",getAddress(RaceLists!E26))))","v":"http://formguide.cyberhorse.com.au/index.php/Form/form.html?formdate=2010-11-24&track=Lakesi&raceno=7"},{"$nulls":12},"",{"$f":"IF(Meetings!D25=\"\",\"\",getAddress(Meetings!D25))","v":"http://www.tabonline.com.au/2010/11/24/PG01.html"},{"$f":"IF(Meetings!E25=\"\",\"\",getAddress(Meetings!E25))","v":"http://www.tabonline.com.au/2010/11/24/PG02.html"},{"$f":"IF(Meetings!F25=\"\",\"\",getAddress(Meetings!F25))","v":"http://www.tabonline.com.au/2010/11/24/PG03.html"},{"$f":"IF(Meetings!G25=\"\",\"\",getAddress(Meetings!G25))","v":"http://www.tabonline.com.au/2010/11/24/PG04.html"},{"$f":"IF(Meetings!H25=\"\",\"\",getAddress(Meetings!H25))","v":"http://www.tabonline.com.au/2010/11/24/PG05.html"},{"$f":"IF(Meetings!I25=\"\",\"\",getAddress(Meetings!I25))","v":"http://www.tabonline.com.au/2010/11/24/PG06.html"},{"$f":"IF(Meetings!J25=\"\",\"\",getAddress(Meetings!J25))","v":"http://www.tabonline.com.au/2010/11/24/PG07.html"},{"$f":"IF(Meetings!K25=\"\",\"\",getAddress(Meetings!K25))","v":"http://www.tabonline.com.au/2010/11/24/PG08.html"},{"$f":"IF(Meetings!L25=\"\",\"\",getAddress(Meetings!L25))","v":"http://www.tabonline.com.au/2010/11/24/PG09.html"},{"$f":"IF(Meetings!M25=\"\",\"\",getAddress(Meetings!M25))","v":"http://www.tabonline.com.au/2010/11/24/PG10.html"},{"$f":"IF(Meetings!N25=\"\",\"\",getAddress(Meetings!N25))","v":"http://www.tabonline.com.au/2010/11/24/PG11.html"},"","Colours: Royal blue"," cream diagonal stripes and purple cap"]
[{"$f":"IF(RaceLists!A27=\"\",\"\",IF(RaceLists!A27=\"END\",\"END\",IF(RaceLists!E27=\"\",\"\",getAddress(RaceLists!E27))))","v":""},{"$nulls":12},"",{"$f":"IF(Meetings!D26=\"\",\"\",getAddress(Meetings!D26))","v":"http://www.tabonline.com.au/2010/11/24/EG01.html"},{"$f":"IF(Meetings!E26=\"\",\"\",getAddress(Meetings!E26))","v":"http://www.tabonline.com.au/2010/11/24/EG02.html"},{"$f":"IF(Meetings!F26=\"\",\"\",getAddress(Meetings!F26))","v":"http://www.tabonline.com.au/2010/11/24/EG03.html"},{"$f":"IF(Meetings!G26=\"\",\"\",getAddress(Meetings!G26))","v":"http://www.tabonline.com.au/2010/11/24/EG04.html"},{"$f":"IF(Meetings!H26=\"\",\"\",getAddress(Meetings!H26))","v":"http://www.tabonline.com.au/2010/11/24/EG05.html"},{"$f":"IF(Meetings!I26=\"\",\"\",getAddress(Meetings!I26))","v":"http://www.tabonline.com.au/2010/11/24/EG06.html"},{"$f":"IF(Meetings!J26=\"\",\"\",getAddress(Meetings!J26))","v":"http://www.tabonline.com.au/2010/11/24/EG07.html"},{"$f":"IF(Meetings!K26=\"\",\"\",getAddress(Meetings!K26))","v":"http://www.tabonline.com.au/2010/11/24/EG08.html"},{"$f":"IF(Meetings!L26=\"\",\"\",getAddress(Meetings!L26))","v":"http://www.tabonline.com.au/2010/11/24/EG09.html"},{"$f":"IF(Meetings!M26=\"\",\"\",getAddress(Meetings!M26))","v":"http://www.tabonline.com.au/2010/11/24/EG10.html"},{"$f":"IF(Meetings!N26=\"\",\"\",getAddress(Meetings!N26))","v":"http://www.tabonline.com.au/2010/11/24/EG11.html"},"","Owners: J E Hickmott"," K J Hickmott"," D King"," G H Curtis"," M R Mulligan"," G J King"," J A Coe"," J N Pearce"," B J Beecroft & T J Macleod",{"$nulls":82},{"$f":"IF($BH27=\"\",\"\",ROUND(0+DM27/0.5,0)*0.5)","v":""},{"$nulls":9},{"$f":"IF($BH27=\"\",\"\",ROUND(0+DW27/0.5,0)*0.5)","v":""},{"$f":"IF($BH27=\"\",\"\",ROUND(0+DX27/0.5,0)*0.5)","v":""}]
[{"$f":"IF(RaceLists!A28=\"\",\"\",IF(RaceLists!A28=\"END\",\"END\",IF(RaceLists!E28=\"\",\"\",getAddress(RaceLists!E28))))","v":"http://formguide.cyberhorse.com.au/index.php/Form/form.html?formdate=2010-11-24&track=MorhPk&raceno=1"},{"$nulls":12},"",{"$f":"IF(Meetings!D27=\"\",\"\",getAddress(Meetings!D27))","v":"http://www.tabonline.com.au/2010/11/24/ZG01.html"},{"$f":"IF(Meetings!E27=\"\",\"\",getAddress(Meetings!E27))","v":"http://www.tabonline.com.au/2010/11/24/ZG02.html"},{"$f":"IF(Meetings!F27=\"\",\"\",getAddress(Meetings!F27))","v":"http://www.tabonline.com.au/2010/11/24/ZG03.html"},{"$f":"IF(Meetings!G27=\"\",\"\",getAddress(Meetings!G27))","v":"http://www.tabonline.com.au/2010/11/24/ZG04.html"},{"$f":"IF(Meetings!H27=\"\",\"\",getAddress(Meetings!H27))","v":"http://www.tabonline.com.au/2010/11/24/ZG05.html"},{"$f":"IF(Meetings!I27=\"\",\"\",getAddress(Meetings!I27))","v":"http://www.tabonline.com.au/2010/11/24/ZG06.html"},{"$f":"IF(Meetings!J27=\"\",\"\",getAddress(Meetings!J27))","v":"http://www.tabonline.com.au/2010/11/24/ZG07.html"},{"$f":"IF(Meetings!K27=\"\",\"\",getAddress(Meetings!K27))","v":"http://www.tabonline.com.au/2010/11/24/ZG08.html"},{"$f":"IF(Meetings!L27=\"\",\"\",getAddress(Meetings!L27))","v":"http://www.tabonline.com.au/2010/11/24/ZG09.html"},{"$f":"IF(Meetings!M27=\"\",\"\",getAddress(Meetings!M27))","v":"http://www.tabonline.com.au/2010/11/24/ZG10.html"},{"$f":"IF(Meetings!N27=\"\",\"\",getAddress(Meetings!N27))","v":"http://www.tabonline.com.au/2010/11/24/ZG11.html"},"","Career:"]
[{"$f":"IF(RaceLists!A29=\"\",\"\",IF(RaceLists!A29=\"END\",\"END\",IF(RaceLists!E29=\"\",\"\",getAddress(RaceLists!E29))))","v":"http://formguide.cyberhorse.com.au/index.php/Form/form.html?formdate=2010-11-24&track=MorhPk&raceno=2"},{"$nulls":12},"",{"$f":"IF(Meetings!D28=\"\",\"\",getAddress(Meetings!D28))","v":""},{"$f":"IF(Meetings!E28=\"\",\"\",getAddress(Meetings!E28))","v":""},{"$f":"IF(Meetings!F28=\"\",\"\",getAddress(Meetings!F28))","v":""},{"$f":"IF(Meetings!G28=\"\",\"\",getAddress(Meetings!G28))","v":""},{"$f":"IF(Meetings!H28=\"\",\"\",getAddress(Meetings!H28))","v":""},{"$f":"IF(Meetings!I28=\"\",\"\",getAddress(Meetings!I28))","v":""},{"$f":"IF(Meetings!J28=\"\",\"\",getAddress(Meetings!J28))","v":""},{"$f":"IF(Meetings!K28=\"\",\"\",getAddress(Meetings!K28))","v":""},{"$f":"IF(Meetings!L28=\"\",\"\",getAddress(Meetings!L28))","v":""},{"$f":"IF(Meetings!M28=\"\",\"\",getAddress(Meetings!M28))","v":""},{"$f":"IF(Meetings!N28=\"\",\"\",getAddress(Meetings!N28))","v":""},"","4:0-0-1"]
[{"$f":"IF(RaceLists!A30=\"\",\"\",IF(RaceLists!A30=\"END\",\"END\",IF(RaceLists!E30=\"\",\"\",getAddress(RaceLists!E30))))","v":"http://formguide.cyberhorse.com.au/index.php/Form/form.html?formdate=2010-11-24&track=MorhPk&raceno=3"},{"$nulls":12},"",{"$f":"IF(Meetings!D29=\"\",\"\",getAddress(Meetings!D29))","v":""},{"$f":"IF(Meetings!E29=\"\",\"\",getAddress(Meetings!E29))","v":""},{"$f":"IF(Meetings!F29=\"\",\"\",getAddress(Meetings!F29))","v":""},{"$f":"IF(Meetings!G29=\"\",\"\",getAddress(Meetings!G29))","v":""},{"$f":"IF(Meetings!H29=\"\",\"\",getAddress(Meetings!H29))","v":""},{"$f":"IF(Meetings!I29=\"\",\"\",getAddress(Meetings!I29))","v":""},{"$f":"IF(Meetings!J29=\"\",\"\",getAddress(Meetings!J29))","v":""},{"$f":"IF(Meetings!K29=\"\",\"\",getAddress(Meetings!K29))","v":""},{"$f":"IF(Meetings!L29=\"\",\"\",getAddress(Meetings!L29))","v":""},{"$f":"IF(Meetings!M29=\"\",\"\",getAddress(Meetings!M29))","v":""},{"$f":"IF(Meetings!N29=\"\",\"\",getAddress(Meetings!N29))","v":""},"","Fast:"]
[{"$f":"IF(RaceLists!A31=\"\",\"\",IF(RaceLists!A31=\"END\",\"END\",IF(RaceLists!E31=\"\",\"\",getAddress(RaceLists!E31))))","v":"http://formguide.cyberhorse.com.au/index.php/Form/form.html?formdate=2010-11-24&track=MorhPk&raceno=4"},{"$nulls":12},"",{"$f":"IF(Meetings!D30=\"\",\"\",getAddress(Meetings!D30))","v":""},{"$f":"IF(Meetings!E30=\"\",\"\",getAddress(Meetings!E30))","v":""},{"$f":"IF(Meetings!F30=\"\",\"\",getAddress(Meetings!F30))","v":""},{"$f":"IF(Meetings!G30=\"\",\"\",getAddress(Meetings!G30))","v":""},{"$f":"IF(Meetings!H30=\"\",\"\",getAddress(Meetings!H30))","v":""},{"$f":"IF(Meetings!I30=\"\",\"\",getAddress(Meetings!I30))","v":""},{"$f":"IF(Meetings!J30=\"\",\"\",getAddress(Meetings!J30))","v":""},{"$f":"IF(Meetings!K30=\"\",\"\",getAddress(Meetings!K30))","v":""},{"$f":"IF(Meetings!L30=\"\",\"\",getAddress(Meetings!L30))","v":""},{"$f":"IF(Meetings!M30=\"\",\"\",getAddress(Meetings!M30))","v":""},{"$f":"IF(Meetings!N30=\"\",\"\",getAddress(Meetings!N30))","v":""},"","0:0-0-0"]
[{"$f":"IF(RaceLists!A32=\"\",\"\",IF(RaceLists!A32=\"END\",\"END\",IF(RaceLists!E32=\"\",\"\",getAddress(RaceLists!E32))))","v":"http://formguide.cyberhorse.com.au/index.php/Form/form.html?formdate=2010-11-24&track=MorhPk&raceno=5"},{"$nulls":12},"",{"$f":"IF(Meetings!D31=\"\",\"\",getAddress(Meetings!D31))","v":""},{"$f":"IF(Meetings!E31=\"\",\"\",getAddress(Meetings!E31))","v":""},{"$f":"IF(Meetings!F31=\"\",\"\",getAddress(Meetings!F31))","v":""},{"$f":"IF(Meetings!G31=\"\",\"\",getAddress(Meetings!G31))","v":""},{"$f":"IF(Meetings!H31=\"\",\"\",getAddress(Meetings!H31))","v":""},{"$f":"IF(Meetings!I31=\"\",\"\",getAddress(Meetings!I31))","v":""},{"$f":"IF(Meetings!J31=\"\",\"\",getAddress(Meetings!J31))","v":""},{"$f":"IF(Meetings!K31=\"\",\"\",getAddress(Meetings!K31))","v":""},{"$f":"IF(Meetings!L31=\"\",\"\",getAddress(Meetings!L31))","v":""},{"$f":"IF(Meetings!M31=\"\",\"\",getAddress(Meetings!M31))","v":""},{"$f":"IF(Meetings!N31=\"\",\"\",getAddress(Meetings!N31))","v":""},"","6-13 6.1L"," M.Brge","2010-11-10"," 1200m"," Good"," Race 1"," 4yo+ Mdn"," Mdn 4+",10000,0," D Robinson",13," Cd 57.0-0.0"," (SW)"," 1:12.23",-35.6," 25/1"," Settled-9 1200-- 800-- Turn-7"," 1-Ambitious Bride 55.0"]
[{"$f":"IF(RaceLists!A33=\"\",\"\",IF(RaceLists!A33=\"END\",\"END\",IF(RaceLists!E33=\"\",\"\",getAddress(RaceLists!E33))))","v":"http://formguide.cyberhorse.com.au/index.php/Form/form.html?formdate=2010-11-24&track=MorhPk&raceno=6"},{"$nulls":12},"",{"$f":"IF(Meetings!D32=\"\",\"\",getAddress(Meetings!D32))","v":""},{"$f":"IF(Meetings!E32=\"\",\"\",getAddress(Meetings!E32))","v":""},{"$f":"IF(Meetings!F32=\"\",\"\",getAddress(Meetings!F32))","v":""},{"$f":"IF(Meetings!G32=\"\",\"\",getAddress(Meetings!G32))","v":""},{"$f":"IF(Meetings!H32=\"\",\"\",getAddress(Meetings!H32))","v":""},{"$f":"IF(Meetings!I32=\"\",\"\",getAddress(Meetings!I32))","v":""},{"$f":"IF(Meetings!J32=\"\",\"\",getAddress(Meetings!J32))","v":""},{"$f":"IF(Meetings!K32=\"\",\"\",getAddress(Meetings!K32))","v":""},{"$f":"IF(Meetings!L32=\"\",\"\",getAddress(Meetings!L32))","v":""},{"$f":"IF(Meetings!M32=\"\",\"\",getAddress(Meetings!M32))","v":""},{"$f":"IF(Meetings!N32=\"\",\"\",getAddress(Meetings!N32))","v":""},"","7-10 9.5L"," F. Bay","2010-07-28"," 1100m"," Good"," Race 3"," Mdn"," Mdn",15200,0," S Scriven",5," Cd 58.0-0.0"," (SW)"," 1:03.78",-34.74," 4/1"," Settled-- 1200-- 800-- Turn--"," 1-Charge Up 58.0"]
[{"$f":"IF(RaceLists!A34=\"\",\"\",IF(RaceLists!A34=\"END\",\"END\",IF(RaceLists!E34=\"\",\"\",getAddress(RaceLists!E34))))","v":"http://formguide.cyberhorse.com.au/index.php/Form/form.html?formdate=2010-11-24&track=MorhPk&raceno=7"},{"$nulls":12},"",{"$f":"IF(Meetings!D33=\"\",\"\",getAddress(Meetings!D33))","v":""},{"$f":"IF(Meetings!E33=\"\",\"\",getAddress(Meetings!E33))","v":""},{"$f":"IF(Meetings!F33=\"\",\"\",getAddress(Meetings!F33))","v":""},{"$f":"IF(Meetings!G33=\"\",\"\",getAddress(Meetings!G33))","v":""},{"$f":"IF(Meetings!H33=\"\",\"\",getAddress(Meetings!H33))","v":""},{"$f":"IF(Meetings!I33=\"\",\"\",getAddress(Meetings!I33))","v":""},{"$f":"IF(Meetings!J33=\"\",\"\",getAddress(Meetings!J33))","v":""},{"$f":"IF(Meetings!K33=\"\",\"\",getAddress(Meetings!K33))","v":""},{"$f":"IF(Meetings!L33=\"\",\"\",getAddress(Meetings!L33))","v":""},{"$f":"IF(Meetings!M33=\"\",\"\",getAddress(Meetings!M33))","v":""},{"$f":"IF(Meetings!N33=\"\",\"\",getAddress(Meetings!N33))","v":""},"","3-12 1.6L"," F. Bay","2010-07-14"," 1200m"," Good"," Race 1"," Mdn Plate"," Mdn",15200,-1300," C Spry",1," Cd 58.0-0.0"," (SW)"," 1:10.80",-36.1," 12/1"," Settled-- 1200-- 800-- Turn--"," 1-Sharvee 58.0"]
[{"$f":"IF(RaceLists!A35=\"\",\"\",IF(RaceLists!A35=\"END\",\"END\",IF(RaceLists!E35=\"\",\"\",getAddress(RaceLists!E35))))","v":"http://formguide.cyberhorse.com.au/index.php/Form/form.html?formdate=2010-11-24&track=MorhPk&raceno=8"},{"$nulls":12},"",{"$f":"IF(Meetings!D34=\"\",\"\",getAddress(Meetings!D34))","v":""},{"$f":"IF(Meetings!E34=\"\",\"\",getAddress(Meetings!E34))","v":""},{"$f":"IF(Meetings!F34=\"\",\"\",getAddress(Meetings!F34))","v":""},{"$f":"IF(Meetings!G34=\"\",\"\",getAddress(Meetings!G34))","v":""},{"$f":"IF(Meetings!H34=\"\",\"\",getAddress(Meetings!H34))","v":""},{"$f":"IF(Meetings!I34=\"\",\"\",getAddress(Meetings!I34))","v":""},{"$f":"IF(Meetings!J34=\"\",\"\",getAddress(Meetings!J34))","v":""},{"$f":"IF(Meetings!K34=\"\",\"\",getAddress(Meetings!K34))","v":""},{"$f":"IF(Meetings!L34=\"\",\"\",getAddress(Meetings!L34))","v":""},{"$f":"IF(Meetings!M34=\"\",\"\",getAddress(Meetings!M34))","v":""},{"$f":"IF(Meetings!N34=\"\",\"\",getAddress(Meetings!N34))","v":""},"","12-13 15.6L"," Balakl","2010-02-28"," 1400m"," Good"," Race 5"," 3yo+ Mdn"," Mdn 3+",10000,0," M Tyndall",6," Cd 53.0--3.0"," (SW)"," 1:23.64"," ()"," 50/1"," Settled-3 1200-- 800-3 Turn-6"," 1-Bunker Boy 56.0"]
[{"$f":"IF(RaceLists!A36=\"\",\"\",IF(RaceLists!A36=\"END\",\"END\",IF(RaceLists!E36=\"\",\"\",getAddress(RaceLists!E36))))","v":""},{"$nulls":12},"",{"$f":"IF(Meetings!D35=\"\",\"\",getAddress(Meetings!D35))","v":""},{"$f":"IF(Meetings!E35=\"\",\"\",getAddress(Meetings!E35))","v":""},{"$f":"IF(Meetings!F35=\"\",\"\",getAddress(Meetings!F35))","v":""},{"$f":"IF(Meetings!G35=\"\",\"\",getAddress(Meetings!G35))","v":""},{"$f":"IF(Meetings!H35=\"\",\"\",getAddress(Meetings!H35))","v":""},{"$f":"IF(Meetings!I35=\"\",\"\",getAddress(Meetings!I35))","v":""},{"$f":"IF(Meetings!J35=\"\",\"\",getAddress(Meetings!J35))","v":""},{"$f":"IF(Meetings!K35=\"\",\"\",getAddress(Meetings!K35))","v":""},{"$f":"IF(Meetings!L35=\"\",\"\",getAddress(Meetings!L35))","v":""},{"$f":"IF(Meetings!M35=\"\",\"\",getAddress(Meetings!M35))","v":""},{"$f":"IF(Meetings!N35=\"\",\"\",getAddress(Meetings!N35))","v":""},"Kotor","2 Kotor (16) 57.0kg 4yo b g"]
[{"$f":"IF(RaceLists!A37=\"\",\"\",IF(RaceLists!A37=\"END\",\"END\",IF(RaceLists!E37=\"\",\"\",getAddress(RaceLists!E37))))","v":"http://formguide.cyberhorse.com.au/index.php/Form/form.html?formdate=2010-11-24&track=W.Farm&raceno=1"},{"$nulls":12},"",{"$f":"IF(Meetings!D36=\"\",\"\",getAddress(Meetings!D36))","v":""},{"$f":"IF(Meetings!E36=\"\",\"\",getAddress(Meetings!E36))","v":""},{"$f":"IF(Meetings!F36=\"\",\"\",getAddress(Meetings!F36))","v":""},{"$f":"IF(Meetings!G36=\"\",\"\",getAddress(Meetings!G36))","v":""},{"$f":"IF(Meetings!H36=\"\",\"\",getAddress(Meetings!H36))","v":""},{"$f":"IF(Meetings!I36=\"\",\"\",getAddress(Meetings!I36))","v":""},{"$f":"IF(Meetings!J36=\"\",\"\",getAddress(Meetings!J36))","v":""},{"$f":"IF(Meetings!K36=\"\",\"\",getAddress(Meetings!K36))","v":""},{"$f":"IF(Meetings!L36=\"\",\"\",getAddress(Meetings!L36))","v":""},{"$f":"IF(Meetings!M36=\"\",\"\",getAddress(Meetings!M36))","v":""},{"$f":"IF(Meetings!N36=\"\",\"\",getAddress(Meetings!N36))","v":""},"","Colours: Burgundy"," gold stripe"," black braces"," white sleeves"," burgundy cuffs"," black cap"]
[{"$f":"IF(RaceLists!A38=\"\",\"\",IF(RaceLists!A38=\"END\",\"END\",IF(RaceLists!E38=\"\",\"\",getAddress(RaceLists!E38))))","v":"http://formguide.cyberhorse.com.au/index.php/Form/form.html?formdate=2010-11-24&track=W.Farm&raceno=2"},{"$nulls":12},"",{"$f":"IF(Meetings!D37=\"\",\"\",getAddress(Meetings!D37))","v":""},{"$f":"IF(Meetings!E37=\"\",\"\",getAddress(Meetings!E37))","v":""},{"$f":"IF(Meetings!F37=\"\",\"\",getAddress(Meetings!F37))","v":""},{"$f":"IF(Meetings!G37=\"\",\"\",getAddress(Meetings!G37))","v":""},{"$f":"IF(Meetings!H37=\"\",\"\",getAddress(Meetings!H37))","v":""},{"$f":"IF(Meetings!I37=\"\",\"\",getAddress(Meetings!I37))","v":""},{"$f":"IF(Meetings!J37=\"\",\"\",getAddress(Meetings!J37))","v":""},{"$f":"IF(Meetings!K37=\"\",\"\",getAddress(Meetings!K37))","v":""},{"$f":"IF(Meetings!L37=\"\",\"\",getAddress(Meetings!L37))","v":""},{"$f":"IF(Meetings!M37=\"\",\"\",getAddress(Meetings!M37))","v":""},{"$f":"IF(Meetings!N37=\"\",\"\",getAddress(Meetings!N37))","v":""},"","Owners: P & Mrs J Zecevich"]
[{"$f":"IF(RaceLists!A39=\"\",\"\",IF(RaceLists!A39=\"END\",\"END\",IF(RaceLists!E39=\"\",\"\",getAddress(RaceLists!E39))))","v":"http://formguide.cyberhorse.com.au/index.php/Form/form.html?formdate=2010-11-24&track=W.Farm&raceno=3"},{"$nulls":12},"",{"$f":"IF(Meetings!D38=\"\",\"\",getAddress(Meetings!D38))","v":""},{"$f":"IF(Meetings!E38=\"\",\"\",getAddress(Meetings!E38))","v":""},{"$f":"IF(Meetings!F38=\"\",\"\",getAddress(Meetings!F38))","v":""},{"$f":"IF(Meetings!G38=\"\",\"\",getAddress(Meetings!G38))","v":""},{"$f":"IF(Meetings!H38=\"\",\"\",getAddress(Meetings!H38))","v":""},{"$f":"IF(Meetings!I38=\"\",\"\",getAddress(Meetings!I38))","v":""},{"$f":"IF(Meetings!J38=\"\",\"\",getAddress(Meetings!J38))","v":""},{"$f":"IF(Meetings!K38=\"\",\"\",getAddress(Meetings!K38))","v":""},{"$f":"IF(Meetings!L38=\"\",\"\",getAddress(Meetings!L38))","v":""},{"$f":"IF(Meetings!M38=\"\",\"\",getAddress(Meetings!M38))","v":""},{"$f":"IF(Meetings!N38=\"\",\"\",getAddress(Meetings!N38))","v":""},"","Career:"]
[{"$f":"IF(RaceLists!A40=\"\",\"\",IF(RaceLists!A40=\"END\",\"END\",IF(RaceLists!E40=\"\",\"\",getAddress(RaceLists!E40))))","v":"http://formguide.cyberhorse.com.au/index.php/Form/form.html?formdate=2010-11-24&track=W.Farm&raceno=4"},{"$nulls":12},"",{"$f":"IF(Meetings!D39=\"\",\"\",getAddress(Meetings!D39))","v":""},{"$f":"IF(Meetings!E39=\"\",\"\",getAddress(Meetings!E39))","v":""},{"$f":"IF(Meetings!F39=\"\",\"\",getAddress(Meetings!F39))","v":""},{"$f":"IF(Meetings!G39=\"\",\"\",getAddress(Meetings!G39))","v":""},{"$f":"IF(Meetings!H39=\"\",\"\",getAddress(Meetings!H39))","v":""},{"$f":"IF(Meetings!I39=\"\",\"\",getAddress(Meetings!I39))","v":""},{"$f":"IF(Meetings!J39=\"\",\"\",getAddress(Meetings!J39))","v":""},{"$f":"IF(Meetings!K39=\"\",\"\",getAddress(Meetings!K39))","v":""},{"$f":"IF(Meetings!L39=\"\",\"\",getAddress(Meetings!L39))","v":""},{"$f":"IF(Meetings!M39=\"\",\"\",getAddress(Meetings!M39))","v":""},{"$f":"IF(Meetings!N39=\"\",\"\",getAddress(Meetings!N39))","v":""},"","4:0-0-1"]
[{"$f":"IF(RaceLists!A41=\"\",\"\",IF(RaceLists!A41=\"END\",\"END\",IF(RaceLists!E41=\"\",\"\",getAddress(RaceLists!E41))))","v":"http://formguide.cyberhorse.com.au/index.php/Form/form.html?formdate=2010-11-24&track=W.Farm&raceno=5"},{"$nulls":12},"",{"$f":"IF(Meetings!D40=\"\",\"\",getAddress(Meetings!D40))","v":""},{"$f":"IF(Meetings!E40=\"\",\"\",getAddress(Meetings!E40))","v":""},{"$f":"IF(Meetings!F40=\"\",\"\",getAddress(Meetings!F40))","v":""},{"$f":"IF(Meetings!G40=\"\",\"\",getAddress(Meetings!G40))","v":""},{"$f":"IF(Meetings!H40=\"\",\"\",getAddress(Meetings!H40))","v":""},{"$f":"IF(Meetings!I40=\"\",\"\",getAddress(Meetings!I40))","v":""},{"$f":"IF(Meetings!J40=\"\",\"\",getAddress(Meetings!J40))","v":""},{"$f":"IF(Meetings!K40=\"\",\"\",getAddress(Meetings!K40))","v":""},{"$f":"IF(Meetings!L40=\"\",\"\",getAddress(Meetings!L40))","v":""},{"$f":"IF(Meetings!M40=\"\",\"\",getAddress(Meetings!M40))","v":""},{"$f":"IF(Meetings!N40=\"\",\"\",getAddress(Meetings!N40))","v":""},"","Fast:"]
[{"$f":"IF(RaceLists!A42=\"\",\"\",IF(RaceLists!A42=\"END\",\"END\",IF(RaceLists!E42=\"\",\"\",getAddress(RaceLists!E42))))","v":"http://formguide.cyberhorse.com.au/index.php/Form/form.html?formdate=2010-11-24&track=W.Farm&raceno=6"},{"$nulls":12},"",{"$f":"IF(Meetings!D41=\"\",\"\",getAddress(Meetings!D41))","v":""},{"$f":"IF(Meetings!E41=\"\",\"\",getAddress(Meetings!E41))","v":""},{"$f":"IF(Meetings!F41=\"\",\"\",getAddress(Meetings!F41))","v":""},{"$f":"IF(Meetings!G41=\"\",\"\",getAddress(Meetings!G41))","v":""},{"$f":"IF(Meetings!H41=\"\",\"\",getAddress(Meetings!H41))","v":""},{"$f":"IF(Meetings!I41=\"\",\"\",getAddress(Meetings!I41))","v":""},{"$f":"IF(Meetings!J41=\"\",\"\",getAddress(Meetings!J41))","v":""},{"$f":"IF(Meetings!K41=\"\",\"\",getAddress(Meetings!K41))","v":""},{"$f":"IF(Meetings!L41=\"\",\"\",getAddress(Meetings!L41))","v":""},{"$f":"IF(Meetings!M41=\"\",\"\",getAddress(Meetings!M41))","v":""},{"$f":"IF(Meetings!N41=\"\",\"\",getAddress(Meetings!N41))","v":""},"","0:0-0-0"]
[{"$f":"IF(RaceLists!A43=\"\",\"\",IF(RaceLists!A43=\"END\",\"END\",IF(RaceLists!E43=\"\",\"\",getAddress(RaceLists!E43))))","v":"http://formguide.cyberhorse.com.au/index.php/Form/form.html?formdate=2010-11-24&track=W.Farm&raceno=7"},{"$nulls":12},"",{"$f":"IF(Meetings!D42=\"\",\"\",getAddress(Meetings!D42))","v":""},{"$f":"IF(Meetings!E42=\"\",\"\",getAddress(Meetings!E42))","v":""},{"$f":"IF(Meetings!F42=\"\",\"\",getAddress(Meetings!F42))","v":""},{"$f":"IF(Meetings!G42=\"\",\"\",getAddress(Meetings!G42))","v":""},{"$f":"IF(Meetings!H42=\"\",\"\",getAddress(Meetings!H42))","v":""},{"$f":"IF(Meetings!I42=\"\",\"\",getAddress(Meetings!I42))","v":""},{"$f":"IF(Meetings!J42=\"\",\"\",getAddress(Meetings!J42))","v":""},{"$f":"IF(Meetings!K42=\"\",\"\",getAddress(Meetings!K42))","v":""},{"$f":"IF(Meetings!L42=\"\",\"\",getAddress(Meetings!L42))","v":""},{"$f":"IF(Meetings!M42=\"\",\"\",getAddress(Meetings!M42))","v":""},{"$f":"IF(Meetings!N42=\"\",\"\",getAddress(Meetings!N42))","v":""},"","5-13 2.4L"," MorhPk","2010-11-04"," 1400m"," Good"," Race 5"," 4yo+ Mdn"," Mdn 4+",10000,0," S Cahill",12," Cd 57.0-0.0"," (SW)"," 1:26.26",-36.74," 9/1"," Settled-7 1200-- 800-- Turn-2"," 1-Master Beckett 55.0"]
[{"$f":"IF(RaceLists!A44=\"\",\"\",IF(RaceLists!A44=\"END\",\"END\",IF(RaceLists!E44=\"\",\"\",getAddress(RaceLists!E44))))","v":"END"},{"$nulls":12},"",{"$f":"IF(Meetings!D43=\"\",\"\",getAddress(Meetings!D43))","v":""},{"$f":"IF(Meetings!E43=\"\",\"\",getAddress(Meetings!E43))","v":""},{"$f":"IF(Meetings!F43=\"\",\"\",getAddress(Meetings!F43))","v":""},{"$f":"IF(Meetings!G43=\"\",\"\",getAddress(Meetings!G43))","v":""},{"$f":"IF(Meetings!H43=\"\",\"\",getAddress(Meetings!H43))","v":""},{"$f":"IF(Meetings!I43=\"\",\"\",getAddress(Meetings!I43))","v":""},{"$f":"IF(Meetings!J43=\"\",\"\",getAddress(Meetings!J43))","v":""},{"$f":"IF(Meetings!K43=\"\",\"\",getAddress(Meetings!K43))","v":""},{"$f":"IF(Meetings!L43=\"\",\"\",getAddress(Meetings!L43))","v":""},{"$f":"IF(Meetings!M43=\"\",\"\",getAddress(Meetings!M43))","v":""},{"$f":"IF(Meetings!N43=\"\",\"\",getAddress(Meetings!N43))","v":""},"","3-13 2.6L"," Strath","2010-10-20"," 1200m"," Good"," Race 5"," 3yo+ Mdn"," Mdn 3+",10000,-900," S Cahill",4," Cd 57.0-0.0"," (SW)"," 1:14.24",-36.26," 11/1"," Settled-2 1200-- 800-- Turn-2"," 1-Chilli Deva 55.0"]
[{"$f":"IF(RaceLists!A45=\"\",\"\",IF(RaceLists!A45=\"END\",\"END\",IF(RaceLists!E45=\"\",\"\",getAddress(RaceLists!E45))))","v":""},{"$nulls":12},"",{"$f":"IF(Meetings!D44=\"\",\"\",getAddress(Meetings!D44))","v":""},{"$f":"IF(Meetings!E44=\"\",\"\",getAddress(Meetings!E44))","v":""},{"$f":"IF(Meetings!F44=\"\",\"\",getAddress(Meetings!F44))","v":""},{"$f":"IF(Meetings!G44=\"\",\"\",getAddress(Meetings!G44))","v":""},{"$f":"IF(Meetings!H44=\"\",\"\",getAddress(Meetings!H44))","v":""},{"$f":"IF(Meetings!I44=\"\",\"\",getAddress(Meetings!I44))","v":""},{"$f":"IF(Meetings!J44=\"\",\"\",getAddress(Meetings!J44))","v":""},{"$f":"IF(Meetings!K44=\"\",\"\",getAddress(Meetings!K44))","v":""},{"$f":"IF(Meetings!L44=\"\",\"\",getAddress(Meetings!L44))","v":""},{"$f":"IF(Meetings!M44=\"\",\"\",getAddress(Meetings!M44))","v":""},{"$f":"IF(Meetings!N44=\"\",\"\",getAddress(Meetings!N44))","v":""},"","7-8 5.8L"," Balakl","2010-09-29"," 1050m"," Dead"," Race 3"," 4yo+ Mdn"," Mdn 4+",10000,0," S Cahill",1," Cd 57.0-0.0"," (SW)"," 1:02.14",-34.21," 6/1"," Settled-4 1200-- 800-- Turn-4"," 1-Hollywood Dream 55.0"]
[{"$f":"IF(RaceLists!A46=\"\",\"\",IF(RaceLists!A46=\"END\",\"END\",IF(RaceLists!E46=\"\",\"\",getAddress(RaceLists!E46))))","v":""},{"$nulls":12},"",{"$nulls":11},"","8-9 5.5L"," M.Brge","2010-03-03"," 1000m"," Good"," Race 2"," 3yo Mdn"," Mdn 3",10000,0," P Gatt",2," Cd 56.5-0.0"," (SW)"," 0:58.54"," ()"," 7/1"," Settled-4 1200-- 800-- Turn-5"," 1-Hearts 'n' Halos 54.5"]
[{"$f":"IF(RaceLists!A47=\"\",\"\",IF(RaceLists!A47=\"END\",\"END\",IF(RaceLists!E47=\"\",\"\",getAddress(RaceLists!E47))))","v":""},{"$nulls":12},"",{"$nulls":11},"Red Hot Jeune","3 Red Hot Jeune (17) 57.0kg 4yo ch g"]
[{"$f":"IF(RaceLists!A48=\"\",\"\",IF(RaceLists!A48=\"END\",\"END\",IF(RaceLists!E48=\"\",\"\",getAddress(RaceLists!E48))))","v":""},{"$nulls":12},"",{"$nulls":11},"","Colours: Royal blue"," pink striped sleeves"," royal blue cap"]
[{"$f":"IF(RaceLists!A49=\"\",\"\",IF(RaceLists!A49=\"END\",\"END\",IF(RaceLists!E49=\"\",\"\",getAddress(RaceLists!E49))))","v":""},{"$nulls":12},"",{"$nulls":11},"","Owners: G L Martin"]
[{"$f":"IF(RaceLists!A50=\"\",\"\",IF(RaceLists!A50=\"END\",\"END\",IF(RaceLists!E50=\"\",\"\",getAddress(RaceLists!E50))))","v":""},{"$nulls":12},"",{"$nulls":11},"","Career:"]
[{"$f":"IF(RaceLists!A51=\"\",\"\",IF(RaceLists!A51=\"END\",\"END\",IF(RaceLists!E51=\"\",\"\",getAddress(RaceLists!E51))))","v":""},{"$nulls":12},"",{"$nulls":11},"","5:0-0-2"]
[{"$f":"IF(RaceLists!A52=\"\",\"\",IF(RaceLists!A52=\"END\",\"END\",IF(RaceLists!E52=\"\",\"\",getAddress(RaceLists!E52))))","v":""},{"$nulls":12},"",{"$nulls":11},"","Fast:"]
[{"$f":"IF(RaceLists!A53=\"\",\"\",IF(RaceLists!A53=\"END\",\"END\",IF(RaceLists!E53=\"\",\"\",getAddress(RaceLists!E53))))","v":""},{"$nulls":12},"",{"$nulls":11},"","0:0-0-0"]
[{"$f":"IF(RaceLists!A54=\"\",\"\",IF(RaceLists!A54=\"END\",\"END\",IF(RaceLists!E54=\"\",\"\",getAddress(RaceLists!E54))))","v":""},{"$nulls":12},"",{"$nulls":11},"","3-13 0.6L"," M.Brge","2010-11-10"," 1200m"," Good"," Race 1"," 4yo+ Mdn"," Mdn 4+",10000,-900," M Neilson",7," Cd 57.0-0.0"," (SW)"," 1:12.23",-35.6," 45/10"," Settled-5 1200-- 800-- Turn-4"," 1-Ambitious Bride 55.0"]
[{"$f":"IF(RaceLists!A55=\"\",\"\",IF(RaceLists!A55=\"END\",\"END\",IF(RaceLists!E55=\"\",\"\",getAddress(RaceLists!E55))))","v":""},{"$nulls":12},"",{"$nulls":11},"","5-12 2.8L"," Gawlr","2010-10-27"," 1100m"," Good"," Race 1"," 3yo+ Mdn"," Mdn 3+",10000,0," M Neilson",5," Cd 57.0-0.0"," (SW)"," 1:04.93",-34.71," 15/2"," Settled-6 1200-- 800-- Turn-6"," 1-Cattyshack 52.0"]
[{"$f":"IF(RaceLists!A56=\"\",\"\",IF(RaceLists!A56=\"END\",\"END\",IF(RaceLists!E56=\"\",\"\",getAddress(RaceLists!E56))))","v":""},{"$nulls":12},"",{"$nulls":11},"","7-12 4.3L"," Balakl","2010-06-09"," 1055m"," Dead"," Race 3"," 3yo+ Mdn"," Mdn 3+",10000,0," S Price",7," Cd 56.5-0.0"," (SW)"," 1:03.40",-36.1," 32/10"," Settled-7 1200-- 800-- Turn-6"," 1-Red England 57.0"]
[{"$f":"IF(RaceLists!A57=\"\",\"\",IF(RaceLists!A57=\"END\",\"END\",IF(RaceLists!E57=\"\",\"\",getAddress(RaceLists!E57))))","v":""},{"$nulls":12},"",{"$nulls":11},"","3-11 3.0L"," M.Brge","2010-05-26"," 1006m"," Dead"," Race 4"," 3yo+ Mdn"," Mdn 3+",10000,-900," S Price",1," Cd 56.5-0.0"," (SW)"," 0:59.55",-35.47," 5/1"," Settled-1 1200-- 800-- Turn-1"," 1-Silent Mode 54.5"]
[{"$f":"IF(RaceLists!A58=\"\",\"\",IF(RaceLists!A58=\"END\",\"END\",IF(RaceLists!E58=\"\",\"\",getAddress(RaceLists!E58))))","v":""},{"$nulls":12},"",{"$nulls":11},"","9-11 3.9L"," Bend","2010-05-07"," 1000m"," Good"," Race 1"," 3yo Mdn"," Mdn 3",13000,-200," M Pumpa",6," Cd 57.0-0.0"," (SW)"," 0:58.68"," ()"," 9/1"," Settled-1 1200-- 800-- Turn-1"," 1-Bel Shandy 57.0"]
[{"$f":"IF(RaceLists!A59=\"\",\"\",IF(RaceLists!A59=\"END\",\"END\",IF(RaceLists!E59=\"\",\"\",getAddress(RaceLists!E59))))","v":""},{"$nulls":12},"",{"$nulls":11},"Shiraz Knight","4 Shiraz Knight (1) 57.0kg 6yo b/br g"]
[{"$f":"IF(RaceLists!A60=\"\",\"\",IF(RaceLists!A60=\"END\",\"END\",IF(RaceLists!E60=\"\",\"\",getAddress(RaceLists!E60))))","v":""},{"$nulls":12},"",{"$nulls":11},"","Colours: Gold"," royal blue spots"," green hooped sleeves and cap"]
[{"$f":"IF(RaceLists!A61=\"\",\"\",IF(RaceLists!A61=\"END\",\"END\",IF(RaceLists!E61=\"\",\"\",getAddress(RaceLists!E61))))","v":""},{"$nulls":12},"",{"$nulls":11},"","Owners: J L P Maddigan"," J L Maddigan"," Mrs K S Maddigan"," P G Hansen & A J Whiley"]
[{"$f":"IF(RaceLists!A62=\"\",\"\",IF(RaceLists!A62=\"END\",\"END\",IF(RaceLists!E62=\"\",\"\",getAddress(RaceLists!E62))))","v":""},{"$nulls":12},"",{"$nulls":11},"","Career:"]
[{"$f":"IF(RaceLists!A63=\"\",\"\",IF(RaceLists!A63=\"END\",\"END\",IF(RaceLists!E63=\"\",\"\",getAddress(RaceLists!E63))))","v":""},{"$nulls":12},"",{"$nulls":11},"","9:0-0-0"]
[{"$f":"IF(RaceLists!A64=\"\",\"\",IF(RaceLists!A64=\"END\",\"END\",IF(RaceLists!E64=\"\",\"\",getAddress(RaceLists!E64))))","v":""},{"$nulls":12},"",{"$nulls":11},"","Fast:"]
[{"$f":"IF(RaceLists!A65=\"\",\"\",IF(RaceLists!A65=\"END\",\"END\",IF(RaceLists!E65=\"\",\"\",getAddress(RaceLists!E65))))","v":""},{"$nulls":12},"",{"$nulls":11},"","0:0-0-0"]
[{"$f":"IF(RaceLists!A66=\"\",\"\",IF(RaceLists!A66=\"END\",\"END\",IF(RaceLists!E66=\"\",\"\",getAddress(RaceLists!E66))))","v":""},{"$nulls":12},"",{"$nulls":11},"","4-12 4.5L"," Gawlr","2010-09-12"," 2100m"," Slow"," Race 2"," 3yo+ Mdn"," Mdn 3+",10000,-600," O Ay",5," Cd 54.0--3.0"," (SW)"," 2:16.97",-39," 55/10"," Settled-11 1200-12 800-12 Turn-10"," 1-Marizza's Dream 53.5"]
[{"$f":"IF(RaceLists!A67=\"\",\"\",IF(RaceLists!A67=\"END\",\"END\",IF(RaceLists!E67=\"\",\"\",getAddress(RaceLists!E67))))","v":""},{"$nulls":12},"",{"$nulls":11},{"$f":"IF(AA67=\"\",\"\",IF(ISERROR(MID(AA67,FIND(\" \",AA67,1)+1,FIND(\"(\",AA67,1)-FIND(\" \",AA67,1)-2)),\"\",MID(AA67,FIND(\" \",AA67,1)+1,FIND(\"(\",AA67,1)-FIND(\" \",AA67,1)-2)))","v":""},"4-10 2.1L"," Gawlr","2010-08-05"," 2100m"," Slow"," Race 4"," 3yo+ Mdn"," Mdn 3+",10000,-600," D Robinson",3," Cd 57.0-0.0"," (SW)"," 2:19.12",-39.15," 20/1"," Settled-10 1200-10 800-9 Turn-7"," 1-Blanche Port 55.0"]
[{"$f":"IF(RaceLists!A68=\"\",\"\",IF(RaceLists!A68=\"END\",\"END\",IF(RaceLists!E68=\"\",\"\",getAddress(RaceLists!E68))))","v":""},{"$nulls":12},{"$f":"IF(M68=\"\",\"\",IF(ISERROR(LEFT(M68,FIND(\"-\",M68)-1)),IF(ISERROR(LEFT(M68,FIND(\" \",M68)-1)),M68,LEFT(M68,FIND(\" \",M68)-1)),LEFT(M68,FIND(\"-\",M68)-1)))","v":""},{"$nulls":11},"","9-10 5.8L"," Strath","2010-07-21"," 2050m"," Slow"," Race 2"," 3yo+ Mdn"," Mdn 3+",10000,0," D Robinson",1," Cd 57.0-0.0"," (SW)"," 2:15.77",-38.97," 8/1"," Settled-7 1200-8 800-8 Turn-9"," 1-Robeson 56.5"]
[{"$f":"IF(RaceLists!A69=\"\",\"\",IF(RaceLists!A69=\"END\",\"END\",IF(RaceLists!E69=\"\",\"\",getAddress(RaceLists!E69))))","v":""},{"$nulls":12},"",{"$nulls":11},"","5-12 2.6L"," MorhPk","2010-07-07"," 1950m"," Dead"," Race 4"," 2yo+ Mdn"," Mdn",10000,0," D Robinson",3," Cd 57.0-0.0"," (SW)"," 2:06.38",-37.51," 14/1"," Settled-10 1200-10 800-8 Turn-10"," 1-Big Love 54.5"]
[{"$f":"IF(RaceLists!A70=\"\",\"\",IF(RaceLists!A70=\"END\",\"END\",IF(RaceLists!E70=\"\",\"\",getAddress(RaceLists!E70))))","v":""},{"$nulls":12},"",{"$nulls":11},"","5-7 4.0L"," M.Brge","2010-06-14"," 1400m"," Dead"," Race 2"," 2yo+ Mdn"," Mdn",10000,0," D Robinson",4," Cd 57.0-0.0"," (SW)"," 1:27.05"," ()"," 25/1"," Settled-6 1200-- 800-6 Turn-7"," 1-Fantastic Glen 54.5"]
[{"$f":"IF(RaceLists!A71=\"\",\"\",IF(RaceLists!A71=\"END\",\"END\",IF(RaceLists!E71=\"\",\"\",getAddress(RaceLists!E71))))","v":""},{"$nulls":12},"",{"$nulls":11},"","8-13 6.6L"," Clare","2010-03-14"," 1800m"," Good"," Race 2"," 3yo+ Mdn"," Mdn 3+",8000,0," D Robinson",5," Cd 57.0-0.0"," (SW)"," 1:55.96"," ()"," 40/1"," Settled-- 1200-- 800-- Turn--"," 1-Lord Of The Song 57.0"]
[{"$f":"IF(RaceLists!A72=\"\",\"\",IF(RaceLists!A72=\"END\",\"END\",IF(RaceLists!E72=\"\",\"\",getAddress(RaceLists!E72))))","v":""},{"$nulls":12},"",{"$nulls":11},"","10-13 7.3L"," Balakl","2010-02-28"," 1400m"," Good"," Race 5"," 3yo+ Mdn"," Mdn 3+",10000,0," O Ay",3," Cd 54.0--3.0"," (SW)"," 1:23.64"," ()"," 50/1"," Settled-11 1200-- 800-12 Turn-10"," 1-Bunker Boy 56.0"]
[{"$f":"IF(RaceLists!A73=\"\",\"\",IF(RaceLists!A73=\"END\",\"END\",IF(RaceLists!E73=\"\",\"\",getAddress(RaceLists!E73))))","v":""},{"$nulls":12},"",{"$nulls":11},"","10-10 7.1L"," Strath","2010-01-27"," 1350m"," Good"," Race 2"," 4yo+ Mdn"," Mdn 4+",7700,0," S Price",4," Cd 57.0-0.0"," (SW)"," 1:22.97"," ()"," 20/1"," Settled-10 1200-- 800-- Turn-10"," 1-Alakate 55.0"]
[{"$f":"IF(RaceLists!A74=\"\",\"\",IF(RaceLists!A74=\"END\",\"END\",IF(RaceLists!E74=\"\",\"\",getAddress(RaceLists!E74))))","v":""},{"$nulls":12},"",{"$nulls":11},"","15-16 26.7L"," Mphvl","2009-08-19"," 1050m"," Good"," Race 3"," 3yo+ Mdn"," Mdn 3+",7700,0," M Hoppo",12," Cd 57.0-0.0"," (SW)"," 0:59.42",-33.86," 40/1"," Settled-14 1200-- 800-- Turn-15"," 1-Definitely Ready 55.0"]
[{"$f":"IF(RaceLists!A75=\"\",\"\",IF(RaceLists!A75=\"END\",\"END\",IF(RaceLists!E75=\"\",\"\",getAddress(RaceLists!E75))))","v":""},{"$nulls":12},"",{"$nulls":11},"Drafted","5 Drafted (2) 55.5kg 3yo br g"]
[{"$f":"IF(RaceLists!A76=\"\",\"\",IF(RaceLists!A76=\"END\",\"END\",IF(RaceLists!E76=\"\",\"\",getAddress(RaceLists!E76))))","v":""},{"$nulls":12},"",{"$nulls":11},"","Colours: White"," red and black diamond sash and armbands"]
[{"$f":"IF(RaceLists!A77=\"\",\"\",IF(RaceLists!A77=\"END\",\"END\",IF(RaceLists!E77=\"\",\"\",getAddress(RaceLists!E77))))","v":""},{"$nulls":12},"",{"$nulls":11},"","Owners: J I Halsall"," P J & Mrs E B Noone"," D P & D A Heffernan"," Diplomats & M A Nunan"]
[{"$f":"IF(RaceLists!A78=\"\",\"\",IF(RaceLists!A78=\"END\",\"END\",IF(RaceLists!E78=\"\",\"\",getAddress(RaceLists!E78))))","v":""},{"$nulls":12},"",{"$nulls":11},"","Career:"]
[{"$f":"IF(RaceLists!A79=\"\",\"\",IF(RaceLists!A79=\"END\",\"END\",IF(RaceLists!E79=\"\",\"\",getAddress(RaceLists!E79))))","v":""},{"$nulls":12},"",{"$nulls":11},"","2010-01-01T04:00:00"]
[{"$f":"IF(RaceLists!A80=\"\",\"\",IF(RaceLists!A80=\"END\",\"END\",IF(RaceLists!E80=\"\",\"\",getAddress(RaceLists!E80))))","v":""},{"$nulls":12},"",{"$nulls":11},"","Fast:"]
[{"$f":"IF(RaceLists!A81=\"\",\"\",IF(RaceLists!A81=\"END\",\"END\",IF(RaceLists!E81=\"\",\"\",getAddress(RaceLists!E81))))","v":""},{"$nulls":12},"",{"$nulls":11},"","0:0-0-0"]
[{"$f":"IF(RaceLists!A82=\"\",\"\",IF(RaceLists!A82=\"END\",\"END\",IF(RaceLists!E82=\"\",\"\",getAddress(RaceLists!E82))))","v":""},{"$nulls":12},"",{"$nulls":11},"","3-12 1.3L"," Gawlr","2010-11-17"," 1100m"," Good"," Race 2"," 3yo+ E&g Mdn"," Mdn 3+",10000,-900," S Cahill",3," Cd 55.5-0.0"," (SW)"," 1:04.90",-35.380000000000003," 15/10F"," Settled-- 1200-- 800-- Turn--"," 1-Vintage Punch 55.5"]
[{"$f":"IF(RaceLists!A83=\"\",\"\",IF(RaceLists!A83=\"END\",\"END\",IF(RaceLists!E83=\"\",\"\",getAddress(RaceLists!E83))))","v":""},{"$nulls":12},"",{"$nulls":11},"","2-13 0.8L"," Mphvl","2010-11-02"," 1200m"," Good"," Race 2"," 3yo+ E&g Mdn"," Mdn 3+",10000,-1800," S Cahill",8," Cd 55.5-0.0"," (SW)"," 1:10.73",-35.619999999999997," 22/10"," Settled-3 1200-- 800-- Turn-5"," 1-Mavross 57.0"]
[{"$f":"IF(RaceLists!A84=\"\",\"\",IF(RaceLists!A84=\"END\",\"END\",IF(RaceLists!E84=\"\",\"\",getAddress(RaceLists!E84))))","v":""},{"$nulls":12},"",{"$nulls":11},"","4-11 3.5L"," Balakl","2010-06-09"," 1210m"," Dead"," Race 1"," 2yo Mdn"," Mdn 2",10000,-600," S Cahill",6," Cd 56.5-0.0"," (SW)"," 1:12.89"," ()"," 11/10F"," Settled-5 1200-- 800-- Turn-5"," 1-Kosciuszko's Side 56.5"]
[{"$f":"IF(RaceLists!A85=\"\",\"\",IF(RaceLists!A85=\"END\",\"END\",IF(RaceLists!E85=\"\",\"\",getAddress(RaceLists!E85))))","v":""},{"$nulls":12},"",{"$nulls":11},"","5-12 4.4L"," Mphvl","2010-05-29"," 1000m"," Dead"," Race 1"," 2yo Hcp"," Open 2",40000,-900," A Patterson",12," Cd 55.5-0.0",-53," 1:00.18",-36.35," 6/1"," Settled-5 1200-- 800-- Turn-6"," 1-Lilgiggleo 54.5"]
[{"$f":"IF(RaceLists!A86=\"\",\"\",IF(RaceLists!A86=\"END\",\"END\",IF(RaceLists!E86=\"\",\"\",getAddress(RaceLists!E86))))","v":""},{"$nulls":12},"",{"$nulls":11},"Baena","6 Baena (18) 55.0kg 4yo b m"]
[{"$f":"IF(RaceLists!A87=\"\",\"\",IF(RaceLists!A87=\"END\",\"END\",IF(RaceLists!E87=\"\",\"\",getAddress(RaceLists!E87))))","v":""},{"$nulls":12},"",{"$nulls":11},"","Colours: Green"," white hooped sleeves"]
[{"$f":"IF(RaceLists!A88=\"\",\"\",IF(RaceLists!A88=\"END\",\"END\",IF(RaceLists!E88=\"\",\"\",getAddress(RaceLists!E88))))","v":""},{"$nulls":12},"",{"$nulls":11},"","Owners: Dr H Awang"," C Tan"," W H Lee"," Dr Y Awang & Dato Azzat Kamaludin"]
[{"$f":"IF(RaceLists!A89=\"\",\"\",IF(RaceLists!A89=\"END\",\"END\",IF(RaceLists!E89=\"\",\"\",getAddress(RaceLists!E89))))","v":""},{"$nulls":12},"",{"$nulls":11},"","Career:"]
[{"$f":"IF(RaceLists!A90=\"\",\"\",IF(RaceLists!A90=\"END\",\"END\",IF(RaceLists!E90=\"\",\"\",getAddress(RaceLists!E90))))","v":""},{"$nulls":12},"",{"$nulls":11},"","1:0-0-0"]
[{"$f":"IF(RaceLists!A91=\"\",\"\",IF(RaceLists!A91=\"END\",\"END\",IF(RaceLists!E91=\"\",\"\",getAddress(RaceLists!E91))))","v":""},{"$nulls":12},"",{"$nulls":11},"","Fast:"]
[{"$f":"IF(RaceLists!A92=\"\",\"\",IF(RaceLists!A92=\"END\",\"END\",IF(RaceLists!E92=\"\",\"\",getAddress(RaceLists!E92))))","v":""},{"$nulls":12},"",{"$nulls":11},"","0:0-0-0"]
[{"$f":"IF(RaceLists!A93=\"\",\"\",IF(RaceLists!A93=\"END\",\"END\",IF(RaceLists!E93=\"\",\"\",getAddress(RaceLists!E93))))","v":""},{"$nulls":12},"",{"$nulls":11},"","7-10 4.7L"," MorhPk","2010-11-04"," 1250m"," Good"," Race 1"," 3yo+ F&m Mdn"," Mdn fm",10000,0," J Frew",1," Cd 53.5--3.0"," (SW)"," 1:15.57",-36.01," 60/1"," Settled-3 1200-- 800-- Turn-7"," 1-Fleet Riane 55.0"]
[{"$f":"IF(RaceLists!A94=\"\",\"\",IF(RaceLists!A94=\"END\",\"END\",IF(RaceLists!E94=\"\",\"\",getAddress(RaceLists!E94))))","v":""},{"$nulls":12},"",{"$nulls":11},"Burgundy Notes","7 Burgundy Notes (14) 55.0kg 5yo b m"]
[{"$f":"IF(RaceLists!A95=\"\",\"\",IF(RaceLists!A95=\"END\",\"END\",IF(RaceLists!E95=\"\",\"\",getAddress(RaceLists!E95))))","v":""},{"$nulls":12},"",{"$nulls":11},"","Colours: Light green"," dark green"," light green sleeves with dark green horse stripe"]
[{"$f":"IF(RaceLists!A96=\"\",\"\",IF(RaceLists!A96=\"END\",\"END\",IF(RaceLists!E96=\"\",\"\",getAddress(RaceLists!E96))))","v":""},{"$nulls":12},"",{"$nulls":11},"","Owners: Tosca Farm Syndicate & Ms H Papazaharoudakis"]
[{"$f":"IF(RaceLists!A97=\"\",\"\",IF(RaceLists!A97=\"END\",\"END\",IF(RaceLists!E97=\"\",\"\",getAddress(RaceLists!E97))))","v":""},{"$nulls":12},"",{"$nulls":11},"","Career:"]
[{"$f":"IF(RaceLists!A98=\"\",\"\",IF(RaceLists!A98=\"END\",\"END\",IF(RaceLists!E98=\"\",\"\",getAddress(RaceLists!E98))))","v":""},{"$nulls":12},"",{"$nulls":11},"","2000-05-01T10:00:00"]
[{"$f":"IF(RaceLists!A99=\"\",\"\",IF(RaceLists!A99=\"END\",\"END\",IF(RaceLists!E99=\"\",\"\",getAddress(RaceLists!E99))))","v":""},{"$nulls":12},"",{"$nulls":11},"","Fast:"]
[{"$f":"IF(RaceLists!A100=\"\",\"\",IF(RaceLists!A100=\"END\",\"END\",IF(RaceLists!E100=\"\",\"\",getAddress(RaceLists!E100))))","v":""},{"$nulls":12},"",{"$nulls":11},"","0:0-0-0"]
[{"$f":"IF(RaceLists!A101=\"\",\"\",IF(RaceLists!A101=\"END\",\"END\",IF(RaceLists!E101=\"\",\"\",getAddress(RaceLists!E101))))","v":""},{"$nulls":12},"",{"$nulls":11},"","7-13 6.2L"," M.Brge","2010-11-10"," 1200m"," Good"," Race 1"," 4yo+ Mdn"," Mdn 4+",10000,0," T Pannell",5," Cd 55.0-0.0"," (SW)"," 1:12.23",-35.6," 4/1"," Settled-4 1200-- 800-- Turn-5"," 1-Ambitious Bride 55.0"]
[{"$nulls":13},"",{"$nulls":11},"","2-6 3.0L"," Balakl","2010-02-28"," 2200m"," Good"," Race 1"," 3yo+ Mdn"," Mdn 3+",10000,-1800," C Lever",1," Cd 55.0-0.0"," (SW)"," 2:23.96"," ()"," 8/11F"," Settled-1 1200-1 800-1 Turn-3"," 1-Pleats 55.0"]
[{"$nulls":13},"",{"$nulls":11},"","2-10 2.3L"," Mphvl","2010-02-03"," 2028m"," Good"," Race 2"," 3yo+ Mdn"," Mdn 3+",10000,-1800," M Neilson",6," Cd 55.0-0.0"," (SW)"," 2:06.17",-36.49," 2/1F"," Settled-4 1200-4 800-4 Turn-5"," 1-Autentico Teatro 57.0"]
[{"$nulls":13},"",{"$nulls":11},"","2-7 0.4L"," Mphvl","2010-01-20"," 2044m"," Good"," Race 4"," 3yo+ Mdn"," Mdn 3+",7700,-1000," M Neilson",6," Cd 55.0-0.0"," (SW)"," 2:09.76",-37.43," 15/10F"," Settled-5 1200-5 800-4 Turn-3"," 1-Hold That Conquest 53.5"]
[{"$nulls":13},"",{"$nulls":11},"","2-9 4.0L"," Mphvl","2010-01-06"," 1600m"," Good"," Race 3"," 3yo+ Mdn"," Mdn 3+",7700,-1300," M Neilson",8," Cd 55.0-0.0"," (SW)"," 1:37.47",-36.35," 4/1"," Settled-7 1200-7 800-7 Turn-5"," 1-Syanna's Bro 57.0"]
[{"$nulls":13},"",{"$nulls":11},"","5-14 5.6L"," Mphvl","2009-12-23"," 1200m"," Good"," Race 4"," 3yo+ Mdn"," Mdn 3+",7700,0," M Neilson",4," Cd 55.0-0.0"," (SW)"," 1:10.68",-35.42," 12/1"," Settled-11 1200-- 800-- Turn-6"," 1-Catsonsong 55.5"]
[{"$nulls":13},"",{"$nulls":11},"","9-11 5.1L"," Balakl","2009-11-25"," 1407m"," Good"," Race 8"," 3yo+ Mdn"," Mdn 3+",7700,0," C Lever",1," Cd 55.0-0.0"," (SW)"," 1:24.30"," ()"," 22/10"," Settled-4 1200-- 800-5 Turn-6"," 1-Sacre Nazaire 57.0"]
[{"$nulls":13},"",{"$nulls":11},"","5-11 3.5L"," M.Brge","2009-11-18"," 1400m"," Good"," Race 8"," 3yo+ Mdn"," Mdn 3+",7700,0," C Lever",7," Cd 55.0-0.0"," (SW)"," 1:24.33"," ()"," 25/10"," Settled-9 1200-- 800-10 Turn-10"," 1-Ucetek 55.0"]
[{"$nulls":13},"",{"$nulls":11},"","2-12 1.0L"," MorhPk","2009-11-05"," 1250m"," Good"," Race 8"," 3yo+ F&m Mdn"," Mdn fm",7700,-1300," C Lever",10," Cd 56.5-0.0"," (SW)"," 1:16.53"," ()"," 12/1"," Settled-8 1200-- 800-- Turn-9"," 1-Zhen Zhen 55.0"]
[{"$nulls":13},"",{"$nulls":11},"","11-13 9.4L"," Balakl","2009-05-20"," 1200m"," Good"," Race 3"," 3yo+ Mdn"," Mdn 3+",7500,0," T Baker",8," Cd 54.5-0.0"," (SW)"," 1:11.64"," ()"," 25/1"," Settled-10 1200-- 800-- Turn-11"," 1-Cybercyn 52.0"]
[{"$nulls":13},"",{"$nulls":11},"Champagne Journey","8 Champagne Journey (12) 55.0kg 4yo ch m"]
[{"$nulls":13},"",{"$nulls":11},"","Colours: Light blue and purple diamonds"," light blue cap"," purple pom pom"]
[{"$nulls":13},"",{"$nulls":11},"","Owners: Miss E Hubbard"," A N Barratt"," C Robertson & Ms M Freeman"]
[{"$nulls":13},"",{"$nulls":11},"","Career:"]
[{"$nulls":13},"",{"$nulls":11},"","2000-01-01T08:00:00"]
[{"$nulls":13},"",{"$nulls":11},"","Fast:"]
[{"$nulls":13},"",{"$nulls":11},"","0:0-0-0"]
[{"$nulls":13},"",{"$nulls":11},"","4-13 2.9L"," M.Brge","2010-11-10"," 1200m"," Good"," Race 1"," 4yo+ Mdn"," Mdn 4+",10000,-600," T Baker",10," Cd 55.0-0.0"," (SW)"," 1:12.23",-35.6," 12/1"," Settled-3 1200-- 800-- Turn-2"," 1-Ambitious Bride 55.0"]
[{"$nulls":13},"",{"$nulls":11},"","4-12 0.6L"," Bortwn","2010-10-24"," 1100m"," Good"," Race 3"," 3yo+ Mdn"," Mdn 3+",8000,-400," T Baker",7," Cd 55.0-0.0"," (SW)"," 1:06.06"," ()"," 6/1"," Settled-- 1200-- 800-- Turn--"," 1-Billy Whitesox 57.0"]
[{"$nulls":13},"",{"$nulls":11},"","2-15 1.5L"," Strath","2010-09-02"," 1250m"," Slow"," Race 5"," 3yo+ Mdn"," Mdn 3+",10000,-1800," T Baker",5," Cd 55.0-0.0"," (SW)"," 1:20.90",-39.58," 12/1"," Settled-1 1200-- 800-- Turn-1"," 1-Any Minute Now 57.0"]
[{"$nulls":13},"",{"$nulls":11},"","5-12 6.0L"," M.Brge","2010-07-28"," 1000m"," Dead"," Race 4"," 3yo+ Mdn"," Mdn 3+",10000,0," T Baker",3," Cd 54.5-0.0"," (SW)"," 0:59.04",-35.119999999999997," 50/1"," Settled-7 1200-- 800-- Turn-9"," 1-Chicago Hood 56.5"]
[{"$nulls":13},"",{"$nulls":11},"","11-12 10.4L"," Seymor","2010-05-24"," 1600m"," Dead"," Race 2"," 2yo+ F&m Mdn"," Mdn fm",12000,0," L Beer",1," Cd 57.0-0.0"," (SW)"," 1:39.65"," ()"," 50/1"," Settled-3 1200-- 800-3 Turn-3"," 1-Bravelli 57.0"]
[{"$nulls":13},"",{"$nulls":11},"","8-12 12.7L"," P'ham","2010-05-08"," 1300m"," Heavy"," Race 1"," 3yo Mdn"," Mdn 3",12000,-200," A Mccabe",5," Cd 54.0--1.0"," (SW)"," 1:21.70"," ()"," 14/1"," Settled-8 1200-- 800-- Turn-8"," 1-Nenagh 55.0"]
[{"$nulls":13},"",{"$nulls":11},"","7-8 7.3L"," G'long","2010-04-09"," 1112m"," Dead"," Race 1"," 2yo+ Mdn Plate"," Mdn",13000,-200," L Currie",8," Cd 55.5-0.0"," (SW)"," 1:06.33",-38.86," 20/1"," Settled-7 1200-- 800-- Turn-8"," 1-Brombed Out 56.0"]
[{"$nulls":13},"",{"$nulls":11},"","6-8 6.1L"," G'long","2010-03-26"," 1103m"," Dead"," Race 2"," 3yo F Mdn"," Mdn 3 f",12000,-200," Michelle Payne",2," Cd 57.0-0.0"," (SW)"," 1:05.74",-34.21," 9/1"," Settled-5 1200-- 800-- Turn-5"," 1-Nothin Mist 57.0"]
[{"$nulls":13},"",{"$nulls":11},"Coco Loco","9 Coco Loco (7) 55.0kg 5yo b m"]
[{"$nulls":13},"",{"$nulls":11},"","Colours: Green"," black and white checked sash"," armbands and cap"]
[{"$nulls":13},"",{"$nulls":11},"","Owners: W P & Mrs E S Benson"]
[{"$nulls":13},"",{"$nulls":11},"","Career:"]
[{"$nulls":13},"",{"$nulls":11},"","2010-04-01T17:00:00"]
[{"$nulls":13},"",{"$nulls":11},{"$f":"IF(AA131=\"\",\"\",IF(ISERROR(MID(AA131,FIND(\" \",AA131,1)+1,FIND(\"(\",AA131,1)-FIND(\" \",AA131,1)-2)),\"\",MID(AA131,FIND(\" \",AA131,1)+1,FIND(\"(\",AA131,1)-FIND(\" \",AA131,1)-2)))","v":""},"Fast:"]
[{"$nulls":13},{"$f":"IF(M132=\"\",\"\",IF(ISERROR(LEFT(M132,FIND(\"-\",M132)-1)),IF(ISERROR(LEFT(M132,FIND(\" \",M132)-1)),M132,LEFT(M132,FIND(\" \",M132)-1)),LEFT(M132,FIND(\"-\",M132)-1)))","v":""},{"$nulls":11},"","0:0-0-0"]
[{"$nulls":13},"",{"$nulls":11},"","3-8 4.6L"," Kem.Gr","2010-07-31"," 1600m"," Heavy"," Race 3"," Mdn"," Mdn",14000,-1400," J Penza",7," Cd 56.5-0.0",-56," 1:45.36",-37.68," 5/1"," Settled-6 1200-- 800-6 Turn-2"," 1-Irish Love 57.5"]
[{"$nulls":13},"",{"$nulls":11},"","2-14 0.2L"," Kem.Gr","2010-07-17"," 1400m"," Good"," Race 4"," F&m Mdn"," Mdn fm",14000,-2800," C Reith",6," Cd 55.5-0.0",-55.5," 1:26.25",-36.299999999999997," 7/2"," Settled-9 1200-- 800-8 Turn-6"," 1-Symphony 55.5"]
[{"$nulls":13},"",{"$nulls":11},"","4-14 3.5L"," Kem.Gr","2010-07-03"," 1300m"," Dead"," Race 7"," Mdn Plate"," Mdn",14000,-700," C Reith",14," Cd 56.0-0.0"," (SW)"," 1:19.78",-34.979999999999997," 11/1"," Settled-14 1200-- 800-- Turn-13"," 1-Patricks 58.0"]
[{"$nulls":13},"",{"$nulls":11},"","4-13 1.3L"," Kem.Gr","2010-06-19"," 1400m"," Dead"," Race 7"," Mdn Plate"," Mdn",14000,-700," J Penza",2," Cd 56.0-0.0"," (SW)"," 1:26.21",-35.61," 9/2"," Settled-5 1200-- 800-6 Turn-6"," 1-Stratocruiser 58.0"]
[{"$nulls":13},"",{"$nulls":11},"","5-6 5.3L"," Kem.Gr","2010-05-29"," 1500m"," Heavy"," Race 7"," Mdn Plate"," Mdn",14000,0," J Penza",3," Cd 56.0-0.0"," (SW)"," 1:33.90",-36.56," 9/4"," Settled-6 1200-- 800-4 Turn-4"," 1-Distant And Lovely 54.5"]
[{"$nulls":13},"",{"$nulls":11},"","3-8 0.9L"," Kem.Gr","2010-05-15"," 1400m"," Good"," Race 1"," Mdn Plate"," Mdn",14000,-1400," J Penza",4," Cd 56.0-0.0"," (SW)"," 1:25.17",-33.409999999999997," 4/1"," Settled-4 1200-- 800-4 Turn-2"," 1-Zoot Suit 58.0"]
[{"$nulls":13},"",{"$nulls":11},"","3-11 2.3L"," N'ctle","2010-05-01"," 1200m"," Dead"," Race 5"," F&m Mdn"," Mdn fm",14000,-1400," C Reith",7," Cd 55.0-0.0",-55," 1:11.32",-35.67," 11/1"," Settled-11 1200-- 800-- Turn-8"," 1-Tokyo Light 55.5"]
[{"$nulls":13},"",{"$nulls":11},"","5-12 2.7L"," N'ctle","2009-12-26"," 1850m"," Dead"," Race 6"," Mdn"," Mdn",14000,0," J Adams",8," Cd 52.5--2.0",-54.5," 1:54.63",-36.1," 8/1"," Settled-12 1200-12 800-12 Turn-8"," 1-Vilayet 55.5"]
[{"$nulls":13},"",{"$nulls":11},"","6-12 1.7L"," C'bury","2009-12-17"," 1550m"," Good"," Race 3"," 3yo+ Mdn"," Mdn 3+",27000,0," J Parr",9," Cd 54.5-0.0",-54.5," 1:34.20",-36.03," 16/1"," Settled-7 1200-- 800-7 Turn-7"," 1-Buffalo 56.5"]
[{"$nulls":13},"",{"$nulls":11},"","7-12 4.5L"," C'bury","2009-12-03"," 1550m"," Good"," Race 2"," 3yo+ Mdn Plate"," Mdn 3+",27000,0," C Brown",7," Cd 56.0-0.0"," (SW)"," 1:35.02",-35.99," 9/1"," Settled-4 1200-- 800-- Turn-5"," 1-I Don't Recall 58.0"]
[{"$nulls":13},"",{"$nulls":11},"Often Away","10 Often Away (9) 55.0kg 4yo b/br m"]
[{"$nulls":13},"",{"$nulls":11},"","Colours: Royal blue"," green and gold logo"," green sleeves"," gold cap and pom pom"]
[{"$nulls":13},"",{"$nulls":11},"Patinack Farm Racing Syndicate","Owners: Patinack Farm Racing Syndicate (mgr: N L Tinkler)"]
[{"$nulls":13},"",{"$nulls":11},"","Career:"]
[{"$nulls":13},"",{"$nulls":11},"",40211.291666666701]
[{"$nulls":13},"",{"$nulls":11},"","Fast:"]
[{"$nulls":13},"",{"$nulls":11},"","0:0-0-0"]
[{"$nulls":13},"",{"$nulls":11},"","2-13 0.1L"," Gawlr","2010-11-17"," 1200m"," Good"," Race 3"," 4yo+ M Mdn"," Mdn 4+ m",10000,-1800," T Pannell",13," Cd 56.5-0.0"," (SW)"," 1:12.22",-36.4," 25/10"," Settled-10 1200-- 800-- Turn-8"," 1-Rippa Matilla 56.5"]
[{"$nulls":13},"",{"$nulls":11},"","2-10 0.1L"," MorhPk","2010-11-04"," 1250m"," Good"," Race 1"," 3yo+ F&m Mdn"," Mdn 3+ fm",10000,-1800," T Pannell",10," Cd 56.5-0.0"," (SW)"," 1:15.57",-36.01," 9/1"," Settled-10 1200-- 800-- Turn-9"," 1-Fleet Riane 55.0"]
[{"$nulls":13},"",{"$nulls":11},"","4-10 4.6L"," Strath","2010-10-20"," 1100m"," Good"," Race 3"," 3yo+ F&m Mdn"," Mdn 3+ fm",10000,-600," C Lever",8," Cd 56.5-0.0"," (SW)"," 1:06.89",-36.130000000000003," 45/10"," Settled-9 1200-- 800-- Turn-9"," 1-Golden Penny 54.5"]
[{"$nulls":13},"",{"$nulls":11},"","4-7 3.5L"," H'bury","2010-04-01"," 1000m"," Slow"," Race 1"," Mdn Plate"," Mdn",16000,-800," B Avdulla",2," Cd 55.5-0.0"," (SW)"," 0:59.32",-35.869999999999997," 12/1"," Settled-6 1200-- 800-- Turn-6"," 1-Maypan 55.5"]
[{"$nulls":13},"",{"$nulls":11},"","3-9 0.5L"," N'ctle","2009-11-15"," 900m"," Good"," Race 1"," 3yo Mdn Plate"," Mdn 3",14000,-1400," P Robl",7," Cd 54.0-0.0"," (SW)"," 0:52.98",-34.1," 10/9F"," Settled-2 1200-- 800-- Turn-2"," 1-It's Our Turn 54.0"]
[{"$nulls":13},"",{"$nulls":11},"","3-10 2.3L"," H'bury","2009-10-22"," 1000m"," Good"," Race 1"," Mdn Plate"," Mdn",16000,-1600," C Munce",7," Cd 53.5-0.0"," (SW)"," 0:57.77",-34.340000000000003," 5/2F"," Settled-4 1200-- 800-- Turn-3"," 1-Dragon's Keep 55.5"]
[{"$nulls":13},"",{"$nulls":11},"","5-7 1.4L"," H'bury","2009-10-11"," 1000m"," Slow"," Race 1"," 3yo Mdn"," Mdn 3",14000,0," H Bowman",6," Cd 56.0-0.0",-55.5," 0:58.89",-35.25," 9/2"," Settled-3 1200-- 800-- Turn-3"," 1-Whiner 56.5"]
[{"$nulls":13},"",{"$nulls":11},"Promotional","11 Promotional (8) 55.0kg 4yo b m"]
[{"$nulls":13},"",{"$nulls":11},"","Colours: Pale blue"," orange spot"]
[{"$nulls":13},"",{"$nulls":11},"","Owners: Pukhraj Breeding & Racing Syndicate"]
[{"$nulls":13},"",{"$nulls":11},"","Career:"]
[{"$nulls":13},"",{"$nulls":11},"","1:0-0-0"]
[{"$nulls":13},"",{"$nulls":11},"","Fast:"]
[{"$nulls":13},"",{"$nulls":11},"","0:0-0-0"]
[{"$nulls":13},"",{"$nulls":11},"","6-9 4.8L"," MorhPk","2010-11-04"," 1250m"," Good"," Race 2"," 3yo+ F&m Mdn"," Mdn fm",10000,0," P Gatt",4," Cd 56.5-0.0"," (SW)"," 1:15.92",-34.770000000000003," 7/1"," Settled-6 1200-- 800-- Turn-6"," 1-Coquelet 53.5"]
[{"$nulls":13},"",{"$nulls":11},"Red Savina","12 Red Savina (11) 55.0kg 4yo b m"]
[{"$nulls":13},"",{"$nulls":11},"","Colours: Royal blue"," black and white checked sash and cap"]
[{"$nulls":13},"",{"$nulls":11},"","Owners: G J Hannan"," Mrs J R Hannan"," D D Bruton & J Vaughan"]
[{"$nulls":13},"",{"$nulls":11},"","Career:"]
[{"$nulls":13},"",{"$nulls":11},"","2010-02-02T07:00:00"]
[{"$nulls":13},"",{"$nulls":11},"","Fast:"]
[{"$nulls":13},"",{"$nulls":11},"","0:0-0-0"]
[{"$nulls":13},"",{"$nulls":11},"","6-10 4.1L"," MorhPk","2010-11-04"," 1250m"," Good"," Race 1"," 3yo+ F&m Mdn"," Mdn fm",10000,0," S Price",6," Cd 56.5-0.0"," (SW)"," 1:15.57",-36.01," 8/11F"," Settled-8 1200-- 800-- Turn-8"," 1-Fleet Riane 55.0"]
[{"$nulls":13},"",{"$nulls":11},"","2-14 0.8L"," Ball't","2010-10-21"," 1200m"," Dead"," Race 2"," 3yo+ F&m Mdn"," Mdn fm",15000,-2700," W Egan",4," Cd 57.0-0.0"," (SW)"," 1:13.12"," ()"," 9/2"," Settled-6 1200-- 800-- Turn-3"," 1-Booklet 54.5"]
[{"$nulls":13},"",{"$nulls":11},"","2-10 0.5L"," Ball't","2010-10-06"," 1200m"," Dead"," Race 2"," 3yo+ F&m Mdn"," Mdn fm",15000,-2700," M Rodd",8," Cd 57.0-0.0"," (SW)"," 1:13.89"," ()"," 11/2"," Settled-3 1200-- 800-- Turn-2"," 1-Our Testament 57.0"]
[{"$nulls":13},"",{"$nulls":11},"","3-11 6.1L"," Seymor","2010-09-16"," 1009m"," Heavy"," Race 3"," 3yo+ Mdn"," Mdn 3+",15000,-1300," M Rodd",10," Cd 56.0-0.0"," (SW)"," 1:00.71"," ()"," 4/1"," Settled-4 1200-- 800-- Turn-4"," 1-Lady Dom 56.0"]
[{"$nulls":13},"",{"$nulls":11},"","7-9 6.1L"," GeeSyn","2010-08-27"," 1100m"," Good"," Race 1"," 3yo+ Mdn Plate"," Mdn 3+",13000,-200," W Egan",1," Cd 56.0-0.0"," (SW)"," 1:05.60",-34.229999999999997," 9/1"," Settled-5 1200-- 800-- Turn-6"," 1-Too Deadly 55.5"]
[{"$nulls":13},"",{"$nulls":11},"","3-12 2.3L"," GeeSyn","2010-08-06"," 1000m"," Good"," Race 3"," 4yo+ Mdn Plate"," Mdn 4+",13000,-1100," M Rodd",9," Cd 56.0-0.0"," (SW)"," 0:58.92",-33.880000000000003," 4/1"," Settled-1 1200-- 800-- Turn-1"," 1-Diamondcowboy 58.0"]
[{"$nulls":13},"",{"$nulls":11},"","6-11 3.5L"," G'long","2009-09-11"," 1340m"," Dead"," Race 4"," 3yo Mdn"," Mdn 3",13000,-200," W Egan",11," Cd 55.0-0.0"," (SW)"," 1:19.76",-35.06," 14/1"," Settled-10 1200-- 800-- Turn-10"," 1-Rebel Truce 57.0"]
[{"$nulls":13},"",{"$nulls":11},"September Rain","13 September Rain (4) 53.5kg 3yo b f"]
[{"$nulls":13},"",{"$nulls":11},"","Colours: White"," pink stripes"," black cap"]
[{"$nulls":13},"",{"$nulls":11},"","Owners: I H Ravenscroft"," M R Ravenscroft"," P J Johnson"," B R Turvey"," M A Ricciuto"," C S Clarke"," W J Butterfield"," J Hazeal"," S Hornhardt & M"]
[{"$nulls":13},"",{"$nulls":11},"","Career:"]
[{"$nulls":13},"",{"$nulls":11},"","2:0-0-0"]
[{"$nulls":13},"",{"$nulls":11},"","Fast:"]
[{"$nulls":13},"",{"$nulls":11},"","0:0-0-0"]
[{"$nulls":13},"",{"$nulls":11},"","4-9 3.9L"," MorhPk","2010-11-04"," 1250m"," Good"," Race 2"," 3yo+ F&m Mdn"," Mdn fm",10000,-600," J Potter",3," Cd 55.0-0.0"," (SW)"," 1:15.92",-34.770000000000003," 6/1"," Settled-4 1200-- 800-- Turn-4"," 1-Coquelet 53.5"]
[{"$nulls":13},"",{"$nulls":11},"","6-8 7.3L"," MorhPk","2010-10-04"," 1000m"," Good"," Race 4"," 3yo F Mdn"," Mdn 3 f",10000,0," C Lindop",6," Cd 56.5-0.0"," (SW)"," 0:58.73",-35.43," 10/1"," Settled-7 1200-- 800-- Turn-7"," 1-Amy's Glen 56.5"]
[{"$nulls":13},"",{"$nulls":11},"Twilight Dancer","14 Twilight Dancer (10) 53.5kg 3yo ch f"]
[{"$nulls":13},"",{"$nulls":11},"","Colours: Red"," white star"]
[{"$nulls":13},"",{"$nulls":11},"","Owners: W A Bogarts & J K Walker"]
[{"$nulls":13},"",{"$nulls":11},"","Career:"]
[{"$nulls":13},"",{"$nulls":11},"","2000-01-01T04:00:00"]
[{"$nulls":13},"",{"$nulls":11},"","Fast:"]
[{"$nulls":13},"",{"$nulls":11},"","0:0-0-0"]
[{"$nulls":13},"",{"$nulls":11},{"$f":"IF(AA195=\"\",\"\",IF(ISERROR(MID(AA195,FIND(\" \",AA195,1)+1,FIND(\"(\",AA195,1)-FIND(\" \",AA195,1)-2)),\"\",MID(AA195,FIND(\" \",AA195,1)+1,FIND(\"(\",AA195,1)-FIND(\" \",AA195,1)-2)))","v":""},"5-13 3.8L"," Mphvl","2010-11-02"," 1100m"," Good"," Race 3"," 3yo F Mdn"," Mdn 3 f",10000,0," L Hopwood",9," Cd 55.0--1.5"," (SW)"," 1:05.04",-35.43," 8/1"," Settled-12 1200-- 800-- Turn-12"," 1-Tigress Joy 56.5"]
[{"$nulls":13},{"$f":"IF(M196=\"\",\"\",IF(ISERROR(LEFT(M196,FIND(\"-\",M196)-1)),IF(ISERROR(LEFT(M196,FIND(\" \",M196)-1)),M196,LEFT(M196,FIND(\" \",M196)-1)),LEFT(M196,FIND(\"-\",M196)-1)))","v":""},{"$nulls":11},"","4-13 4.2L"," Gawlr","2010-10-06"," 1200m"," Good"," Race 4"," 3yo Mdn"," Mdn 3",10000,-600," L Hopwood",3," Cd 54.5-0.0"," (SW)"," 1:12.23",-36.479999999999997," 8/1"," Settled-6 1200-- 800-- Turn-5"," 1-It's Home 56.5"]
[{"$nulls":13},"",{"$nulls":11},"","9-12 7.6L"," MorhPk","2010-05-08"," 1250m"," Good"," Race 2"," 2yo Rst1"," RS1MW 2",32000,-400," L Hopwood",3," Cd 54.0--1.5",-54.5," 1:15.22",-37.89," 4/1"," Settled-4 1200-- 800-- Turn-5"," 1-Condelago 56.5"]
[{"$nulls":13},"",{"$nulls":11},"","2-14 1.5L"," MorhPk","2010-04-28"," 1000m"," Good"," Race 2"," 2yo Mdn Plate"," Mdn 2",10000,-1800," L Hopwood",2," Cd 53.0--1.5"," (SW)"," 0:59.11",-36.35," 8/1"," Settled-5 1200-- 800-- Turn-4"," 1-Monegasque 56.5"]
[{"$nulls":13},"",{"$nulls":11},"Boolcunda Gold","15 Boolcunda Gold (3) 55.5kg 3yo b g"]
[{"$nulls":13},"",{"$nulls":11},"","Colours: Red and white hoops"," royal blue and white hooped sleeves"," red and white qtrd cap"]
[{"$nulls":13},"",{"$nulls":11},"","Owners: M H Wauchope"," P R Barrett"," S Benson"," B J Dunn & Mrs S Benson"]
[{"$nulls":13},"",{"$nulls":11},"","Career:"]
[{"$nulls":13},"",{"$nulls":11},"","2:0-0-0"]
[{"$nulls":13},"",{"$nulls":11},"","Fast:"]
[{"$nulls":13},"",{"$nulls":11},"","0:0-0-0"]
[{"$nulls":13},"",{"$nulls":11},"","8-12 5.6L"," Penola","2010-11-14"," 1400m"," Dead"," Race 3"," 3yo+ Mdn"," Mdn 3+",8500,0," A Herrmann",9," Cd 55.5-0.0"," (SW)"," 1:28.00"," ()"," 14/1"," Settled-- 1200-- 800-- Turn--"," 1-Double Hennessy 57.0"]
[{"$nulls":13},"",{"$nulls":11},"","9-13 10.3L"," Gawlr","2010-10-27"," 1200m"," Good"," Race 2"," 3yo Mdn"," Mdn 3",10000,0," J Potter",5," Cd 56.5-0.0"," (SW)"," 1:11.11",-34.81," 20/1"," Settled-9 1200-- 800-- Turn-7"," 1-Jeter 54.5"]
[{"$nulls":13},"",{"$nulls":11},"Steely Resolve","16 Steely Resolve (5) 57.0kg 4yo b h"]
[{"$nulls":13},"",{"$nulls":11},"","Colours: Maroon"," gold"," sleeves and cap"]
[{"$nulls":13},"",{"$nulls":11},"","Owners: S Lee"," M Lee"," S W Kwong"," A Cham"," T D Marvin"," J P Kwong"," Y H Kwok & C L Chin"]
[{"$nulls":13},"",{"$nulls":11},"","Career:"]
[{"$nulls":13},"",{"$nulls":11},"","2:0-0-0"]
[{"$nulls":13},"",{"$nulls":11},"","Fast:"]
[{"$nulls":13},"",{"$nulls":11},"","0:0-0-0"]
[{"$nulls":13},"",{"$nulls":11},"","7-13 4.6L"," Mphvl","2010-11-02"," 1200m"," Good"," Race 2"," 3yo+ E&g Mdn"," Mdn 3+ eg",10000,0," D Tourneur",10," Cd 57.0-0.0"," (SW)"," 1:10.73",-35.619999999999997," 20/1"," Settled-2 1200-- 800-- Turn-6"," 1-Mavross 57.0"]
[{"$nulls":13},"",{"$nulls":11},"","8-13 5.5L"," Mphvl","2010-06-26"," 1100m"," Slow"," Race 7"," 3yo Hcp"," Open 3",40000,-400," T Pannell",10," Cd 54.0-0.0",-53.5," 1:06.16",-35.630000000000003," 100/1"," Settled-9 1200-- 800-- Turn-7"," 1-Streetcar Magic 57.5"]
[{"$nulls":13},"",{"$nulls":11},"Mr Diligent","17 Mr Diligent (15) 55.5kg 3yo br g"]
[{"$nulls":13},"",{"$nulls":11},"","Colours: Light blue"," royal blue"," diagonal stripes"," light blue cap"]
[{"$nulls":13},"",{"$nulls":11},"","Owners: W J Smart"]
[{"$nulls":13},"",{"$nulls":11},"","Career:"]
[{"$nulls":13},"",{"$nulls":11},"","3:0-0-0"]
[{"$nulls":13},"",{"$nulls":11},"","Fast:"]
[{"$nulls":13},"",{"$nulls":11},"","0:0-0-0"]
[{"$nulls":13},"",{"$nulls":11},"","11-12 11.6L"," Gawlr","2010-11-17"," 1100m"," Good"," Race 2"," 3yo+ E&g Mdn"," Mdn 3+",10000,0," T Pannell",10," Cd 55.5-0.0"," (SW)"," 1:04.90",-35.380000000000003," 100/1"," Settled-- 1200-- 800-- Turn--"," 1-Vintage Punch 55.5"]
[{"$nulls":13},"",{"$nulls":11},"","6-7 4.8L"," Halidn","2010-09-19"," 1000m"," Good"," Race 1"," 3yo Mdn"," Mdn 3",8000,0," T Pannell",4," Cd 56.5-0.0"," (SW)"," 0:58.84"," ()"," 25/1"," Settled-- 1200-- 800-- Turn--"," 1-Stake Your Claim 54.5"]
[{"$nulls":13},"",{"$nulls":11},"","9-9 16.5L"," MorhPk","2010-05-15"," 1000m"," Good"," Race 1"," 2yo Hcp"," Open 2",40000,-400," T Pannell",4," Cd 55.5-0.0",-53," 0:58.75",-34.5," 40/1"," Settled-8 1200-- 800-- Turn-8"," 1-Spirited Eagle 57.5"]
[{"$nulls":13},"",{"$nulls":11},"Deed Of Honor","18 Deed Of Honor (6) 57.0kg 4yo b g"]
[{"$nulls":13},"",{"$nulls":11},"","Colours: Black"," pink spots"]
[{"$nulls":13},"",{"$nulls":11},"","Owners: K J Matson & Mrs L Matson"]
[{"$nulls":13},"",{"$nulls":11},"","Career:"]
[{"$nulls":13},"",{"$nulls":11},"","3:0-0-0"]
[{"$nulls":13},"",{"$nulls":11},"","Fast:"]
[{"$nulls":13},"",{"$nulls":11},"","0:0-0-0"]
[{"$nulls":13},"",{"$nulls":11},"","8-11 8.3L"," Balakl","2010-03-31"," 1600m"," Good"," Race 4"," 3yo+ Mdn"," Mdn 3+",10000,0," J Frew",7," Cd 53.0--3.0"," (SW)"," 1:37.99"," ()"," 100/1"," Settled-6 1200-- 800-5 Turn-5"," 1-Lannaki 54.0"]
[{"$nulls":13},"",{"$nulls":11},"","10-12 11.6L"," Oakbnk","2010-03-13"," 1400m"," Dead"," Race 3"," 3yo Rst1"," RS1MW 3",32000,-400," J Frew",11," Cd 51.5--2.0",-53.5," 1:29.75"," ()"," 300/1"," Settled-7 1200-- 800-7 Turn-10"," 1-Exalted Blonde 53.5"]
[{"$nulls":13},"",{"$nulls":11},"","15-16 10.5L"," M.Brge","2010-03-03"," 1200m"," Good"," Race 4"," 3yo+ Mdn"," Mdn 3+",10000,0," K Dyson",10," Cd 54.5--1.5"," (SW)"," 1:11.90"," ()"," 30/1"," Settled-16 1200-- 800-- Turn-16"," 1-Andamooka Gem 56.0"]
[{"$nulls":13},"",{"$nulls":11},"Pack Saddle","18 Pack Saddle (13) 57.0kg 4yo b g"]
[{"$nulls":13},"",{"$nulls":11},"","Colours: Blue"," white seams"," hooped sleeves"," white cap"]
[{"$nulls":13},"",{"$nulls":11},"","Owners: T R Hull"," P P Sheehan"," K J Dorward"," I L Rodgers"," L J Darling"," J A Smith"," L J Simpson"," A M Murray"," P J Blacker & Mrs M J Hill"]
[{"$nulls":13},"",{"$nulls":11},"","Career:"]
[{"$nulls":13},"",{"$nulls":11},"","3:0-0-0"]
[{"$nulls":13},"",{"$nulls":11},"","Fast:"]
[{"$nulls":13},"",{"$nulls":11},"","0:0-0-0"]
[{"$nulls":13},"",{"$nulls":11},"","9-13 5.5L"," Mphvl","2010-11-02"," 1200m"," Good"," Race 2"," 3yo+ E&g Mdn"," Mdn 3+ eg",10000,0," M Hoppo",9," Cd 57.0-0.0"," (SW)"," 1:10.73",-35.619999999999997," 60/1"," Settled-4 1200-- 800-- Turn-10"," 1-Mavross 57.0"]
[{"$nulls":13},"",{"$nulls":11},"","12-12 15.6L"," Mphvl","2009-11-03"," 1600m"," Good"," Race 3"," 3yo+ Mdn"," Mdn 3+",7700,0," J Frew",10," Cd 52.5--3.0"," (SW)"," 1:37.16"," ()"," 60/1"," Settled-11 1200-11 800-11 Turn-11"," 1-French Secret 57.0"]
[{"$nulls":13},"",{"$nulls":11},"","9-9 19.5L"," Strath","2009-10-21"," 1100m"," Good"," Race 1"," 3yo Hcp (c1)"," Cls 1 3",8200,0," J Frew",5," Cd 54.0--2.5",-54," 1:05.80"," ()"," 20/1"," Settled-9 1200-- 800-- Turn-9"," 1-Miss Tuscan 54.5"]
[{"$nulls":13},"",{"$nulls":11},""]
[{"$nulls":13},"",{"$nulls":11},""]
[{"$nulls":13},"",{"$nulls":11},""]
[{"$nulls":13},"",{"$nulls":11},""]
[{"$nulls":13},"",{"$nulls":11},""]
[{"$nulls":13},"",{"$nulls":11},""]
[{"$nulls":13},"",{"$nulls":11},""]
[{"$nulls":13},"",{"$nulls":11},""]
[{"$nulls":13},"",{"$nulls":11},""]
[{"$nulls":13},"",{"$nulls":11},""]
[{"$nulls":13},"",{"$nulls":11},""]
[{"$nulls":13},"",{"$nulls":11},""]
[{"$nulls":13},"",{"$nulls":11},{"$f":"IF(AA259=\"\",\"\",IF(ISERROR(MID(AA259,FIND(\" \",AA259,1)+1,FIND(\"(\",AA259,1)-FIND(\" \",AA259,1)-2)),\"\",MID(AA259,FIND(\" \",AA259,1)+1,FIND(\"(\",AA259,1)-FIND(\" \",AA259,1)-2)))","v":""}]
[{"$nulls":13},{"$f":"IF(M260=\"\",\"\",IF(ISERROR(LEFT(M260,FIND(\"-\",M260)-1)),IF(ISERROR(LEFT(M260,FIND(\" \",M260)-1)),M260,LEFT(M260,FIND(\" \",M260)-1)),LEFT(M260,FIND(\"-\",M260)-1)))","v":""},{"$nulls":11},""]
[{"$nulls":13},"",{"$nulls":11},""]
[{"$nulls":13},"",{"$nulls":11},""]
[{"$nulls":13},"",{"$nulls":11},""]
[{"$nulls":13},"",{"$nulls":11},""]
[{"$nulls":13},"",{"$nulls":11},""]
[{"$nulls":13},"",{"$nulls":11},""]
[{"$nulls":13},"",{"$nulls":11},""]
[{"$nulls":13},"",{"$nulls":11},""]
[{"$nulls":13},"",{"$nulls":11},""]
[{"$nulls":13},"",{"$nulls":11},""]
[{"$nulls":13},"",{"$nulls":11},""]
[{"$nulls":13},"",{"$nulls":11},""]
[{"$nulls":13},"",{"$nulls":11},""]
[{"$nulls":13},"",{"$nulls":11},""]
[{"$nulls":13},"",{"$nulls":11},""]
[{"$nulls":13},"",{"$nulls":11},""]
[{"$nulls":13},"",{"$nulls":11},""]
[{"$nulls":13},"",{"$nulls":11},""]
[{"$nulls":13},"",{"$nulls":11},""]
[{"$nulls":13},"",{"$nulls":11},""]
[{"$nulls":13},"",{"$nulls":11},""]
[{"$nulls":13},"",{"$nulls":11},""]
[{"$nulls":13},"",{"$nulls":11},""]
[{"$nulls":13},"",{"$nulls":11},""]
[{"$nulls":13},"",{"$nulls":11},""]
[{"$nulls":13},"",{"$nulls":11},""]
[{"$nulls":13},"",{"$nulls":11},""]
[{"$nulls":13},"",{"$nulls":11},""]
[{"$nulls":13},"",{"$nulls":11},""]
[{"$nulls":13},"",{"$nulls":11},""]
[{"$nulls":13},"",{"$nulls":11},""]
[{"$nulls":13},"",{"$nulls":11},""]
[{"$nulls":13},"",{"$nulls":11},""]
[{"$nulls":13},"",{"$nulls":11},""]
[{"$nulls":13},"",{"$nulls":11},""]
[{"$nulls":13},"",{"$nulls":11},""]
[{"$nulls":13},"",{"$nulls":11},""]
[{"$nulls":13},"",{"$nulls":11},""]
[{"$nulls":13},"",{"$nulls":11},""]
[{"$nulls":13},"",{"$nulls":11},""]
[{"$nulls":13},"",{"$nulls":11},""]
[{"$nulls":13},"",{"$nulls":11},""]
[{"$nulls":13},"",{"$nulls":11},""]
[{"$nulls":13},"",{"$nulls":11},""]
[{"$nulls":13},"",{"$nulls":11},""]
[{"$nulls":13},"",{"$nulls":11},""]
[{"$nulls":13},"",{"$nulls":11},""]
[{"$nulls":13},"",{"$nulls":11},""]
[{"$nulls":13},"",{"$nulls":11},""]
[{"$nulls":13},"",{"$nulls":11},""]
[{"$nulls":13},"",{"$nulls":11},""]
[{"$nulls":13},"",{"$nulls":11},""]
[{"$nulls":13},"",{"$nulls":11},""]
[{"$nulls":13},"",{"$nulls":11},""]
[{"$nulls":13},"",{"$nulls":11},""]
[{"$nulls":13},"",{"$nulls":11},""]
[{"$nulls":13},"",{"$nulls":11},""]
[{"$nulls":13},"",{"$nulls":11},""]
[{"$nulls":13},"",{"$nulls":11},""]
[{"$nulls":13},"",{"$nulls":11},""]
[{"$nulls":13},"",{"$nulls":11},""]
[{"$nulls":13},"",{"$nulls":11},""]
[{"$nulls":13},"",{"$nulls":11},{"$f":"IF(AA323=\"\",\"\",IF(ISERROR(MID(AA323,FIND(\" \",AA323,1)+1,FIND(\"(\",AA323,1)-FIND(\" \",AA323,1)-2)),\"\",MID(AA323,FIND(\" \",AA323,1)+1,FIND(\"(\",AA323,1)-FIND(\" \",AA323,1)-2)))","v":""}]
[{"$nulls":13},{"$f":"IF(M324=\"\",\"\",IF(ISERROR(LEFT(M324,FIND(\"-\",M324)-1)),IF(ISERROR(LEFT(M324,FIND(\" \",M324)-1)),M324,LEFT(M324,FIND(\" \",M324)-1)),LEFT(M324,FIND(\"-\",M324)-1)))","v":""},{"$nulls":11},""]
[{"$nulls":13},"",{"$nulls":11},""]
[{"$nulls":13},"",{"$nulls":11},""]
[{"$nulls":13},"",{"$nulls":11},""]
[{"$nulls":13},"",{"$nulls":11},""]
[{"$nulls":13},"",{"$nulls":11},""]
[{"$nulls":13},"",{"$nulls":11},""]
[{"$nulls":13},"",{"$nulls":11},""]
[{"$nulls":13},"",{"$nulls":11},""]
[{"$nulls":13},"",{"$nulls":11},""]
[{"$nulls":13},"",{"$nulls":11},""]
[{"$nulls":13},"",{"$nulls":11},""]
[{"$nulls":13},"",{"$nulls":11},""]
[{"$nulls":13},"",{"$nulls":11},""]
[{"$nulls":13},"",{"$nulls":11},""]
[{"$nulls":13},"",{"$nulls":11},""]
[{"$nulls":13},"",{"$nulls":11},""]
[{"$nulls":13},"",{"$nulls":11},""]
[{"$nulls":13},"",{"$nulls":11},""]
[{"$nulls":13},"",{"$nulls":11},""]
[{"$nulls":13},"",{"$nulls":11},""]
[{"$nulls":13},"",{"$nulls":11},""]
[{"$nulls":13},"",{"$nulls":11},""]
[{"$nulls":13},"",{"$nulls":11},""]
[{"$nulls":13},"",{"$nulls":11},""]
[{"$nulls":13},"",{"$nulls":11},""]
[{"$nulls":13},"",{"$nulls":11},""]
[{"$nulls":13},"",{"$nulls":11},""]
[{"$nulls":13},"",{"$nulls":11},""]
[{"$nulls":13},"",{"$nulls":11},""]
[{"$nulls":13},"",{"$nulls":11},""]
[{"$nulls":13},"",{"$nulls":11},""]
[{"$nulls":13},"",{"$nulls":11},""]
[{"$nulls":13},"",{"$nulls":11},""]
[{"$nulls":13},"",{"$nulls":11},""]
[{"$nulls":13},"",{"$nulls":11},""]
[{"$nulls":13},"",{"$nulls":11},""]
[{"$nulls":13},"",{"$nulls":11},""]
[{"$nulls":13},"",{"$nulls":11},""]
[{"$nulls":13},"",{"$nulls":11},""]
[{"$nulls":13},"",{"$nulls":11},""]
[{"$nulls":13},"",{"$nulls":11},""]
[{"$nulls":13},"",{"$nulls":11},""]
[{"$nulls":13},"",{"$nulls":11},""]
[{"$nulls":13},"",{"$nulls":11},""]
[{"$nulls":13},"",{"$nulls":11},""]
[{"$nulls":13},"",{"$nulls":11},""]
[{"$nulls":13},"",{"$nulls":11},""]
[{"$nulls":13},"",{"$nulls":11},""]
[{"$nulls":13},"",{"$nulls":11},""]
[{"$nulls":13},"",{"$nulls":11},""]
[{"$nulls":13},"",{"$nulls":11},""]
[{"$nulls":13},"",{"$nulls":11},""]
[{"$nulls":13},"",{"$nulls":11},""]
[{"$nulls":13},"",{"$nulls":11},""]
[{"$nulls":13},"",{"$nulls":11},""]
[{"$nulls":13},"",{"$nulls":11},""]
[{"$nulls":13},"",{"$nulls":11},""]
[{"$nulls":13},"",{"$nulls":11},""]
[{"$nulls":13},"",{"$nulls":11},""]
[{"$nulls":13},"",{"$nulls":11},""]
[{"$nulls":13},"",{"$nulls":11},""]
[{"$nulls":13},"",{"$nulls":11},""]
[{"$nulls":13},"",{"$nulls":11},{"$f":"IF(AA387=\"\",\"\",IF(ISERROR(MID(AA387,FIND(\" \",AA387,1)+1,FIND(\"(\",AA387,1)-FIND(\" \",AA387,1)-2)),\"\",MID(AA387,FIND(\" \",AA387,1)+1,FIND(\"(\",AA387,1)-FIND(\" \",AA387,1)-2)))","v":""}]
[{"$nulls":13},{"$f":"IF(M388=\"\",\"\",IF(ISERROR(LEFT(M388,FIND(\"-\",M388)-1)),IF(ISERROR(LEFT(M388,FIND(\" \",M388)-1)),M388,LEFT(M388,FIND(\" \",M388)-1)),LEFT(M388,FIND(\"-\",M388)-1)))","v":""},{"$nulls":11},""]
[{"$nulls":13},"",{"$nulls":11},""]
[{"$nulls":13},"",{"$nulls":11},""]
[{"$nulls":13},"",{"$nulls":11},""]
[{"$nulls":13},"",{"$nulls":11},""]
[{"$nulls":13},"",{"$nulls":11},""]
[{"$nulls":13},"",{"$nulls":11},""]
[{"$nulls":13},"",{"$nulls":11},""]
[{"$nulls":13},"",{"$nulls":11},""]
[{"$nulls":13},"",{"$nulls":11},""]
[{"$nulls":13},"",{"$nulls":11},""]
[{"$nulls":13},"",{"$nulls":11},""]
[{"$nulls":13},"",{"$nulls":11},""]
[{"$nulls":13},"",{"$nulls":11},""]
[{"$nulls":13},"",{"$nulls":11},""]
[{"$nulls":13},"",{"$nulls":11},""]
[{"$nulls":13},"",{"$nulls":11},""]
[{"$nulls":13},"",{"$nulls":11},""]
[{"$nulls":13},"",{"$nulls":11},""]
[{"$nulls":13},"",{"$nulls":11},""]
[{"$nulls":13},"",{"$nulls":11},""]
[{"$nulls":13},"",{"$nulls":11},""]
[{"$nulls":13},"",{"$nulls":11},""]
[{"$nulls":13},"",{"$nulls":11},""]
[{"$nulls":13},"",{"$nulls":11},""]
[{"$nulls":13},"",{"$nulls":11},""]
[{"$nulls":13},"",{"$nulls":11},""]
[{"$nulls":13},"",{"$nulls":11},""]
[{"$nulls":13},"",{"$nulls":11},""]
[{"$nulls":13},"",{"$nulls":11},""]
[{"$nulls":13},"",{"$nulls":11},""]
[{"$nulls":13},"",{"$nulls":11},""]
[{"$nulls":13},"",{"$nulls":11},""]
[{"$nulls":13},"",{"$nulls":11},""]
[{"$nulls":13},"",{"$nulls":11},""]
[{"$nulls":13},"",{"$nulls":11},""]
[{"$nulls":13},"",{"$nulls":11},""]
[{"$nulls":13},"",{"$nulls":11},""]
[{"$nulls":13},"",{"$nulls":11},""]
[{"$nulls":13},"",{"$nulls":11},""]
[{"$nulls":13},"",{"$nulls":11},""]
[{"$nulls":13},"",{"$nulls":11},""]
[{"$nulls":13},"",{"$nulls":11},""]
[{"$nulls":13},"",{"$nulls":11},""]
[{"$nulls":13},"",{"$nulls":11},""]
[{"$nulls":13},"",{"$nulls":11},""]
[{"$nulls":13},"",{"$nulls":11},""]
[{"$nulls":13},"",{"$nulls":11},""]
[{"$nulls":13},"",{"$nulls":11},""]
[{"$nulls":13},"",{"$nulls":11},""]
[{"$nulls":13},"",{"$nulls":11},""]
[{"$nulls":13},"",{"$nulls":11},""]
[{"$nulls":13},"",{"$nulls":11},""]
[{"$nulls":13},"",{"$nulls":11},""]
[{"$nulls":13},"",{"$nulls":11},""]
[{"$nulls":13},"",{"$nulls":11},""]
[{"$nulls":13},"",{"$nulls":11},""]
[{"$nulls":13},"",{"$nulls":11},""]
[{"$nulls":13},"",{"$nulls":11},""]
[{"$nulls":13},"",{"$nulls":11},""]
[{"$nulls":13},"",{"$nulls":11},""]
[{"$nulls":13},"",{"$nulls":11},""]
[{"$nulls":13},"",{"$nulls":11},""]
[{"$nulls":13},"",{"$nulls":11},{"$f":"IF(AA451=\"\",\"\",IF(ISERROR(MID(AA451,FIND(\" \",AA451,1)+1,FIND(\"(\",AA451,1)-FIND(\" \",AA451,1)-2)),\"\",MID(AA451,FIND(\" \",AA451,1)+1,FIND(\"(\",AA451,1)-FIND(\" \",AA451,1)-2)))","v":""}]
[{"$nulls":13},{"$f":"IF(M452=\"\",\"\",IF(ISERROR(LEFT(M452,FIND(\"-\",M452)-1)),IF(ISERROR(LEFT(M452,FIND(\" \",M452)-1)),M452,LEFT(M452,FIND(\" \",M452)-1)),LEFT(M452,FIND(\"-\",M452)-1)))","v":""},{"$nulls":11},""]
[{"$nulls":13},"",{"$nulls":11},""]
[{"$nulls":13},"",{"$nulls":11},""]
[{"$nulls":13},"",{"$nulls":11},""]
[{"$nulls":13},"",{"$nulls":11},""]
[{"$nulls":13},"",{"$nulls":11},""]
[{"$nulls":13},"",{"$nulls":11},""]
[{"$nulls":13},"",{"$nulls":11},""]
[{"$nulls":13},"",{"$nulls":11},""]
[{"$nulls":13},"",{"$nulls":11},""]
[{"$nulls":13},"",{"$nulls":11},""]
[{"$nulls":13},"",{"$nulls":11},""]
[{"$nulls":13},"",{"$nulls":11},""]
[{"$nulls":13},"",{"$nulls":11},""]
[{"$nulls":13},"",{"$nulls":11},""]
[{"$nulls":13},"",{"$nulls":11},""]
[{"$nulls":13},"",{"$nulls":11},""]
[{"$nulls":13},"",{"$nulls":11},""]
[{"$nulls":13},"",{"$nulls":11},""]
[{"$nulls":13},"",{"$nulls":11},""]
[{"$nulls":13},"",{"$nulls":11},""]
[{"$nulls":13},"",{"$nulls":11},""]
[{"$nulls":13},"",{"$nulls":11},""]
[{"$nulls":13},"",{"$nulls":11},""]
[{"$nulls":13},"",{"$nulls":11},""]
[{"$nulls":13},"",{"$nulls":11},""]
[{"$nulls":13},"",{"$nulls":11},""]
[{"$nulls":13},"",{"$nulls":11},""]
[{"$nulls":13},"",{"$nulls":11},""]
[{"$nulls":13},"",{"$nulls":11},""]
[{"$nulls":13},"",{"$nulls":11},""]
[{"$nulls":13},"",{"$nulls":11},""]
[{"$nulls":13},"",{"$nulls":11},""]
[{"$nulls":13},"",{"$nulls":11},""]
[{"$nulls":13},"",{"$nulls":11},""]
[{"$nulls":13},"",{"$nulls":11},""]
[{"$nulls":13},"",{"$nulls":11},""]
[{"$nulls":13},"",{"$nulls":11},""]
[{"$nulls":13},"",{"$nulls":11},""]
[{"$nulls":13},"",{"$nulls":11},""]
[{"$nulls":13},"",{"$nulls":11},""]
[{"$nulls":13},"",{"$nulls":11},""]
[{"$nulls":13},"",{"$nulls":11},""]
[{"$nulls":13},"",{"$nulls":11},""]
[{"$nulls":13},"",{"$nulls":11},""]
[{"$nulls":13},"",{"$nulls":11},""]
[{"$nulls":13},"",{"$nulls":11},""]
[{"$nulls":13},"",{"$nulls":11},""]
[{"$nulls":13},"",{"$nulls":11},""]
[{"$nulls":13},"",{"$nulls":11},""]
[{"$nulls":13},"",{"$nulls":11},""]
[{"$nulls":13},"",{"$nulls":11},""]
[{"$nulls":13},"",{"$nulls":11},""]
[{"$nulls":13},"",{"$nulls":11},""]
[{"$nulls":13},"",{"$nulls":11},""]
[{"$nulls":13},"",{"$nulls":11},""]
[{"$nulls":13},"",{"$nulls":11},""]
[{"$nulls":13},"",{"$nulls":11},""]
[{"$nulls":13},"",{"$nulls":11},""]
[{"$nulls":13},"",{"$nulls":11},""]
[{"$nulls":13},"",{"$nulls":11},""]
[{"$nulls":13},"",{"$nulls":11},""]
[{"$nulls":13},"",{"$nulls":11},""]
[{"$nulls":13},"",{"$nulls":11},{"$f":"IF(AA515=\"\",\"\",IF(ISERROR(MID(AA515,FIND(\" \",AA515,1)+1,FIND(\"(\",AA515,1)-FIND(\" \",AA515,1)-2)),\"\",MID(AA515,FIND(\" \",AA515,1)+1,FIND(\"(\",AA515,1)-FIND(\" \",AA515,1)-2)))","v":""}]
[{"$nulls":13},{"$f":"IF(M516=\"\",\"\",IF(ISERROR(LEFT(M516,FIND(\"-\",M516)-1)),IF(ISERROR(LEFT(M516,FIND(\" \",M516)-1)),M516,LEFT(M516,FIND(\" \",M516)-1)),LEFT(M516,FIND(\"-\",M516)-1)))","v":""},{"$nulls":11},""]
[{"$nulls":13},"",{"$nulls":11},""]
[{"$nulls":13},"",{"$nulls":11},""]
[{"$nulls":13},"",{"$nulls":11},""]
[{"$nulls":13},"",{"$nulls":11},""]
[{"$nulls":13},"",{"$nulls":11},""]
[{"$nulls":13},"",{"$nulls":11},""]
[{"$nulls":13},"",{"$nulls":11},""]
[{"$nulls":13},"",{"$nulls":11},""]
[{"$nulls":13},"",{"$nulls":11},""]
[{"$nulls":13},"",{"$nulls":11},""]
[{"$nulls":13},"",{"$nulls":11},""]
[{"$nulls":13},"",{"$nulls":11},""]
[{"$nulls":13},"",{"$nulls":11},""]
[{"$nulls":13},"",{"$nulls":11},""]
[{"$nulls":13},"",{"$nulls":11},""]
[{"$nulls":13},"",{"$nulls":11},""]
[{"$nulls":13},"",{"$nulls":11},""]
[{"$nulls":13},"",{"$nulls":11},""]
[{"$nulls":13},"",{"$nulls":11},""]
[{"$nulls":13},"",{"$nulls":11},""]
[{"$nulls":13},"",{"$nulls":11},""]
[{"$nulls":13},"",{"$nulls":11},""]
[{"$nulls":13},"",{"$nulls":11},""]
[{"$nulls":13},"",{"$nulls":11},""]
[{"$nulls":13},"",{"$nulls":11},""]
[{"$nulls":13},"",{"$nulls":11},""]
[{"$nulls":13},"",{"$nulls":11},""]
[{"$nulls":13},"",{"$nulls":11},""]
[{"$nulls":13},"",{"$nulls":11},""]
[{"$nulls":13},"",{"$nulls":11},""]
[{"$nulls":13},"",{"$nulls":11},""]
[{"$nulls":13},"",{"$nulls":11},""]
[{"$nulls":13},"",{"$nulls":11},""]
[{"$nulls":13},"",{"$nulls":11},""]
[{"$nulls":13},"",{"$nulls":11},""]
[{"$nulls":13},"",{"$nulls":11},""]
[{"$nulls":13},"",{"$nulls":11},""]
[{"$nulls":13},"",{"$nulls":11},""]
[{"$nulls":13},"",{"$nulls":11},""]
[{"$nulls":13},"",{"$nulls":11},""]
[{"$nulls":13},"",{"$nulls":11},""]
[{"$nulls":13},"",{"$nulls":11},""]
[{"$nulls":13},"",{"$nulls":11},""]
[{"$nulls":13},"",{"$nulls":11},""]
[{"$nulls":13},"",{"$nulls":11},""]
[{"$nulls":13},"",{"$nulls":11},""]
[{"$nulls":13},"",{"$nulls":11},""]
[{"$nulls":13},"",{"$nulls":11},""]
[{"$nulls":13},"",{"$nulls":11},""]
[{"$nulls":13},"",{"$nulls":11},""]
[{"$nulls":13},"",{"$nulls":11},""]
[{"$nulls":13},"",{"$nulls":11},""]
[{"$nulls":13},"",{"$nulls":11},""]
[{"$nulls":13},"",{"$nulls":11},""]
[{"$nulls":13},"",{"$nulls":11},""]
[{"$nulls":13},"",{"$nulls":11},""]
[{"$nulls":13},"",{"$nulls":11},""]
[{"$nulls":13},"",{"$nulls":11},""]
[{"$nulls":13},"",{"$nulls":11},""]
[{"$nulls":13},"",{"$nulls":11},""]
[{"$nulls":13},"",{"$nulls":11},""]
[{"$nulls":13},"",{"$nulls":11},""]
[{"$nulls":13},"",{"$nulls":11},{"$f":"IF(AA579=\"\",\"\",IF(ISERROR(MID(AA579,FIND(\" \",AA579,1)+1,FIND(\"(\",AA579,1)-FIND(\" \",AA579,1)-2)),\"\",MID(AA579,FIND(\" \",AA579,1)+1,FIND(\"(\",AA579,1)-FIND(\" \",AA579,1)-2)))","v":""}]
[{"$nulls":13},{"$f":"IF(M580=\"\",\"\",IF(ISERROR(LEFT(M580,FIND(\"-\",M580)-1)),IF(ISERROR(LEFT(M580,FIND(\" \",M580)-1)),M580,LEFT(M580,FIND(\" \",M580)-1)),LEFT(M580,FIND(\"-\",M580)-1)))","v":""},{"$nulls":11},""]
[{"$nulls":13},"",{"$nulls":11},""]
[{"$nulls":13},"",{"$nulls":11},""]
[{"$nulls":13},"",{"$nulls":11},""]
[{"$nulls":13},"",{"$nulls":11},""]
[{"$nulls":13},"",{"$nulls":11},""]
[{"$nulls":13},"",{"$nulls":11},""]
[{"$nulls":13},"",{"$nulls":11},""]
[{"$nulls":13},"",{"$nulls":11},""]
[{"$nulls":13},"",{"$nulls":11},""]
[{"$nulls":13},"",{"$nulls":11},""]
[{"$nulls":13},"",{"$nulls":11},""]
[{"$nulls":13},"",{"$nulls":11},""]
[{"$nulls":13},"",{"$nulls":11},""]
[{"$nulls":13},"",{"$nulls":11},""]
[{"$nulls":13},"",{"$nulls":11},""]
[{"$nulls":13},"",{"$nulls":11},""]
[{"$nulls":13},"",{"$nulls":11},""]
[{"$nulls":13},"",{"$nulls":11},""]
[{"$nulls":13},"",{"$nulls":11},""]
[{"$nulls":13},"",{"$nulls":11},""]
[{"$nulls":13},"",{"$nulls":11},""]
[{"$nulls":13},"",{"$nulls":11},""]
[{"$nulls":13},"",{"$nulls":11},""]
[{"$nulls":13},"",{"$nulls":11},""]
[{"$nulls":13},"",{"$nulls":11},""]
[{"$nulls":13},"",{"$nulls":11},""]
[{"$nulls":13},"",{"$nulls":11},""]
[{"$nulls":13},"",{"$nulls":11},""]
[{"$nulls":13},"",{"$nulls":11},""]
[{"$nulls":13},"",{"$nulls":11},""]
[{"$nulls":13},"",{"$nulls":11},""]
[{"$nulls":13},"",{"$nulls":11},""]
[{"$nulls":13},"",{"$nulls":11},""]
[{"$nulls":13},"",{"$nulls":11},""]
[{"$nulls":13},"",{"$nulls":11},""]
[{"$nulls":13},"",{"$nulls":11},""]
[{"$nulls":13},"",{"$nulls":11},""]
[{"$nulls":13},"",{"$nulls":11},""]
[{"$nulls":13},"",{"$nulls":11},""]
[{"$nulls":13},"",{"$nulls":11},""]
[{"$nulls":13},"",{"$nulls":11},""]
[{"$nulls":13},"",{"$nulls":11},""]
[{"$nulls":13},"",{"$nulls":11},""]
[{"$nulls":13},"",{"$nulls":11},""]
[{"$nulls":13},"",{"$nulls":11},""]
[{"$nulls":13},"",{"$nulls":11},""]
[{"$nulls":13},"",{"$nulls":11},""]
[{"$nulls":13},"",{"$nulls":11},""]
[{"$nulls":13},"",{"$nulls":11},""]
[{"$nulls":13},"",{"$nulls":11},""]
[{"$nulls":13},"",{"$nulls":11},""]
[{"$nulls":13},"",{"$nulls":11},""]
[{"$nulls":13},"",{"$nulls":11},""]
[{"$nulls":13},"",{"$nulls":11},""]
[{"$nulls":13},"",{"$nulls":11},""]
[{"$nulls":13},"",{"$nulls":11},""]
[{"$nulls":13},"",{"$nulls":11},""]
[{"$nulls":13},"",{"$nulls":11},""]
[{"$nulls":13},"",{"$nulls":11},""]
[{"$nulls":13},"",{"$nulls":11},""]
[{"$nulls":13},"",{"$nulls":11},""]
[{"$nulls":13},"",{"$nulls":11},""]
[{"$nulls":13},"",{"$nulls":11},{"$f":"IF(AA643=\"\",\"\",IF(ISERROR(MID(AA643,FIND(\" \",AA643,1)+1,FIND(\"(\",AA643,1)-FIND(\" \",AA643,1)-2)),\"\",MID(AA643,FIND(\" \",AA643,1)+1,FIND(\"(\",AA643,1)-FIND(\" \",AA643,1)-2)))","v":""}]
[{"$nulls":13},{"$f":"IF(M644=\"\",\"\",IF(ISERROR(LEFT(M644,FIND(\"-\",M644)-1)),IF(ISERROR(LEFT(M644,FIND(\" \",M644)-1)),M644,LEFT(M644,FIND(\" \",M644)-1)),LEFT(M644,FIND(\"-\",M644)-1)))","v":""},{"$nulls":11},""]
[{"$nulls":13},"",{"$nulls":11},""]
[{"$nulls":13},"",{"$nulls":11},""]
[{"$nulls":13},"",{"$nulls":11},""]
[{"$nulls":13},"",{"$nulls":11},""]
[{"$nulls":13},"",{"$nulls":11},""]
[{"$nulls":13},"",{"$nulls":11},""]
[{"$nulls":13},"",{"$nulls":11},""]
[{"$nulls":13},"",{"$nulls":11},""]
[{"$nulls":13},"",{"$nulls":11},""]
[{"$nulls":13},"",{"$nulls":11},""]
[{"$nulls":13},"",{"$nulls":11},""]
[{"$nulls":13},"",{"$nulls":11},""]
[{"$nulls":13},"",{"$nulls":11},""]
[{"$nulls":13},"",{"$nulls":11},""]
[{"$nulls":13},"",{"$nulls":11},""]
[{"$nulls":13},"",{"$nulls":11},""]
[{"$nulls":13},"",{"$nulls":11},""]
[{"$nulls":13},"",{"$nulls":11},""]
[{"$nulls":13},"",{"$nulls":11},""]
[{"$nulls":13},"",{"$nulls":11},""]
[{"$nulls":13},"",{"$nulls":11},""]
[{"$nulls":13},"",{"$nulls":11},""]
[{"$nulls":13},"",{"$nulls":11},""]
[{"$nulls":13},"",{"$nulls":11},""]
[{"$nulls":13},"",{"$nulls":11},""]
[{"$nulls":13},"",{"$nulls":11},""]
[{"$nulls":13},"",{"$nulls":11},""]
[{"$nulls":13},"",{"$nulls":11},""]
[{"$nulls":13},"",{"$nulls":11},""]
[{"$nulls":13},"",{"$nulls":11},""]
[{"$nulls":13},"",{"$nulls":11},""]
[{"$nulls":13},"",{"$nulls":11},""]
[{"$nulls":13},"",{"$nulls":11},""]
[{"$nulls":13},"",{"$nulls":11},""]
[{"$nulls":13},"",{"$nulls":11},""]
[{"$nulls":13},"",{"$nulls":11},""]
[{"$nulls":13},"",{"$nulls":11},""]
[{"$nulls":13},"",{"$nulls":11},""]
[{"$nulls":13},"",{"$nulls":11},""]
[{"$nulls":13},"",{"$nulls":11},""]
[{"$nulls":13},"",{"$nulls":11},""]
[{"$nulls":13},"",{"$nulls":11},""]
[{"$nulls":13},"",{"$nulls":11},""]
[{"$nulls":13},"",{"$nulls":11},""]
[{"$nulls":13},"",{"$nulls":11},""]
[{"$nulls":13},"",{"$nulls":11},""]
[{"$nulls":13},"",{"$nulls":11},""]
[{"$nulls":13},"",{"$nulls":11},""]
[{"$nulls":13},"",{"$nulls":11},""]
[{"$nulls":13},"",{"$nulls":11},""]
[{"$nulls":13},"",{"$nulls":11},""]
[{"$nulls":13},"",{"$nulls":11},""]
[{"$nulls":13},"",{"$nulls":11},""]
[{"$nulls":13},"",{"$nulls":11},""]
[{"$nulls":13},"",{"$nulls":11},""]
[{"$nulls":13},"",{"$nulls":11},""]
[{"$nulls":13},"",{"$nulls":11},""]
[{"$nulls":13},"",{"$nulls":11},""]
[{"$nulls":13},"",{"$nulls":11},""]
[{"$nulls":13},"",{"$nulls":11},""]
[{"$nulls":13},"",{"$nulls":11},""]
[{"$nulls":13},"",{"$nulls":11},""]
[{"$nulls":13},"",{"$nulls":11},{"$f":"IF(AA707=\"\",\"\",IF(ISERROR(MID(AA707,FIND(\" \",AA707,1)+1,FIND(\"(\",AA707,1)-FIND(\" \",AA707,1)-2)),\"\",MID(AA707,FIND(\" \",AA707,1)+1,FIND(\"(\",AA707,1)-FIND(\" \",AA707,1)-2)))","v":""}]
[{"$nulls":13},{"$f":"IF(M708=\"\",\"\",IF(ISERROR(LEFT(M708,FIND(\"-\",M708)-1)),IF(ISERROR(LEFT(M708,FIND(\" \",M708)-1)),M708,LEFT(M708,FIND(\" \",M708)-1)),LEFT(M708,FIND(\"-\",M708)-1)))","v":""},{"$nulls":11},""]
[{"$nulls":13},"",{"$nulls":11},""]
[{"$nulls":13},"",{"$nulls":11},""]
[{"$nulls":13},"",{"$nulls":11},""]
[{"$nulls":13},"",{"$nulls":11},""]
[{"$nulls":13},"",{"$nulls":11},""]
[{"$nulls":13},"",{"$nulls":11},""]
[{"$nulls":13},"",{"$nulls":11},""]
[{"$nulls":13},"",{"$nulls":11},""]
[{"$nulls":13},"",{"$nulls":11},""]
[{"$nulls":13},"",{"$nulls":11},""]
[{"$nulls":13},"",{"$nulls":11},""]
[{"$nulls":13},"",{"$nulls":11},""]
[{"$nulls":13},"",{"$nulls":11},""]
[{"$nulls":13},"",{"$nulls":11},""]
[{"$nulls":13},"",{"$nulls":11},""]
[{"$nulls":13},"",{"$nulls":11},""]
[{"$nulls":13},"",{"$nulls":11},""]
[{"$nulls":13},"",{"$nulls":11},""]
[{"$nulls":13},"",{"$nulls":11},""]
[{"$nulls":13},"",{"$nulls":11},""]
[{"$nulls":13},"",{"$nulls":11},""]
[{"$nulls":13},"",{"$nulls":11},""]
[{"$nulls":13},"",{"$nulls":11},""]
[{"$nulls":13},"",{"$nulls":11},""]
[{"$nulls":13},"",{"$nulls":11},""]
[{"$nulls":13},"",{"$nulls":11},""]
[{"$nulls":13},"",{"$nulls":11},""]
[{"$nulls":13},"",{"$nulls":11},""]
[{"$nulls":13},"",{"$nulls":11},""]
[{"$nulls":13},"",{"$nulls":11},""]
[{"$nulls":13},"",{"$nulls":11},""]
[{"$nulls":13},"",{"$nulls":11},""]
[{"$nulls":13},"",{"$nulls":11},""]
[{"$nulls":13},"",{"$nulls":11},""]
[{"$nulls":13},"",{"$nulls":11},""]
[{"$nulls":13},"",{"$nulls":11},""]
[{"$nulls":13},"",{"$nulls":11},""]
[{"$nulls":13},"",{"$nulls":11},""]
[{"$nulls":13},"",{"$nulls":11},""]
[{"$nulls":13},"",{"$nulls":11},""]
[{"$nulls":13},"",{"$nulls":11},""]
[{"$nulls":13},"",{"$nulls":11},""]
[{"$nulls":13},"",{"$nulls":11},""]
[{"$nulls":13},"",{"$nulls":11},""]
[{"$nulls":13},"",{"$nulls":11},""]
[{"$nulls":13},"",{"$nulls":11},""]
[{"$nulls":13},"",{"$nulls":11},""]
[{"$nulls":13},"",{"$nulls":11},""]
[{"$nulls":13},"",{"$nulls":11},""]
[{"$nulls":13},"",{"$nulls":11},""]
[{"$nulls":13},"",{"$nulls":11},""]
[{"$nulls":13},"",{"$nulls":11},""]
[{"$nulls":13},"",{"$nulls":11},""]
[{"$nulls":13},"",{"$nulls":11},""]
[{"$nulls":13},"",{"$nulls":11},""]
[{"$nulls":13},"",{"$nulls":11},""]
[{"$nulls":13},"",{"$nulls":11},""]
[{"$nulls":13},"",{"$nulls":11},""]
[{"$nulls":13},"",{"$nulls":11},""]
[{"$nulls":13},"",{"$nulls":11},""]
[{"$nulls":13},"",{"$nulls":11},""]
[{"$nulls":13},"",{"$nulls":11},""]
[{"$nulls":13},"",{"$nulls":11},{"$f":"IF(AA771=\"\",\"\",IF(ISERROR(MID(AA771,FIND(\" \",AA771,1)+1,FIND(\"(\",AA771,1)-FIND(\" \",AA771,1)-2)),\"\",MID(AA771,FIND(\" \",AA771,1)+1,FIND(\"(\",AA771,1)-FIND(\" \",AA771,1)-2)))","v":""}]
[{"$nulls":13},{"$f":"IF(M772=\"\",\"\",IF(ISERROR(LEFT(M772,FIND(\"-\",M772)-1)),IF(ISERROR(LEFT(M772,FIND(\" \",M772)-1)),M772,LEFT(M772,FIND(\" \",M772)-1)),LEFT(M772,FIND(\"-\",M772)-1)))","v":""},{"$nulls":11},""]
[{"$nulls":13},"",{"$nulls":11},""]
[{"$nulls":13},"",{"$nulls":11},""]
[{"$nulls":13},"",{"$nulls":11},""]
[{"$nulls":13},"",{"$nulls":11},""]
[{"$nulls":13},"",{"$nulls":11},""]
[{"$nulls":13},"",{"$nulls":11},""]
[{"$nulls":13},"",{"$nulls":11},""]
[{"$nulls":13},"",{"$nulls":11},""]
[{"$nulls":13},"",{"$nulls":11},""]
[{"$nulls":13},"",{"$nulls":11},""]
[{"$nulls":13},"",{"$nulls":11},""]
[{"$nulls":13},"",{"$nulls":11},""]
[{"$nulls":13},"",{"$nulls":11},""]
[{"$nulls":13},"",{"$nulls":11},""]
[{"$nulls":13},"",{"$nulls":11},""]
[{"$nulls":13},"",{"$nulls":11},""]
[{"$nulls":13},"",{"$nulls":11},""]
[{"$nulls":13},"",{"$nulls":11},""]
[{"$nulls":13},"",{"$nulls":11},""]
[{"$nulls":13},"",{"$nulls":11},""]
[{"$nulls":13},"",{"$nulls":11},""]
[{"$nulls":13},"",{"$nulls":11},""]
[{"$nulls":13},"",{"$nulls":11},""]
[{"$nulls":13},"",{"$nulls":11},""]
[{"$nulls":13},"",{"$nulls":11},""]
[{"$nulls":13},"",{"$nulls":11},""]
[{"$nulls":13},"",{"$nulls":11},""]
[{"$nulls":13},"",{"$nulls":11},""]
[{"$nulls":13},"",{"$nulls":11},""]
[{"$nulls":13},"",{"$nulls":11},""]
[{"$nulls":13},"",{"$nulls":11},""]
[{"$nulls":13},"",{"$nulls":11},""]
[{"$nulls":13},"",{"$nulls":11},""]
[{"$nulls":13},"",{"$nulls":11},""]
[{"$nulls":13},"",{"$nulls":11},""]
[{"$nulls":13},"",{"$nulls":11},""]
[{"$nulls":13},"",{"$nulls":11},""]
[{"$nulls":13},"",{"$nulls":11},""]
[{"$nulls":13},"",{"$nulls":11},""]
[{"$nulls":13},"",{"$nulls":11},""]
[{"$nulls":13},"",{"$nulls":11},""]
[{"$nulls":13},"",{"$nulls":11},""]
[{"$nulls":13},"",{"$nulls":11},""]
[{"$nulls":13},"",{"$nulls":11},""]
[{"$nulls":13},"",{"$nulls":11},""]
[{"$nulls":13},"",{"$nulls":11},""]
[{"$nulls":13},"",{"$nulls":11},""]
[{"$nulls":13},"",{"$nulls":11},""]
[{"$nulls":13},"",{"$nulls":11},""]
[{"$nulls":13},"",{"$nulls":11},""]
[{"$nulls":13},"",{"$nulls":11},""]
[{"$nulls":13},"",{"$nulls":11},""]
[{"$nulls":13},"",{"$nulls":11},""]
[{"$nulls":13},"",{"$nulls":11},""]
[{"$nulls":13},"",{"$nulls":11},""]
[{"$nulls":13},"",{"$nulls":11},""]
[{"$nulls":13},"",{"$nulls":11},""]
[{"$nulls":13},"",{"$nulls":11},""]
[{"$nulls":13},"",{"$nulls":11},""]
[{"$nulls":13},"",{"$nulls":11},""]
[{"$nulls":13},"",{"$nulls":11},""]
[{"$nulls":13},"",{"$nulls":11},""]
[{"$nulls":13},"",{"$nulls":11},{"$f":"IF(AA835=\"\",\"\",IF(ISERROR(MID(AA835,FIND(\" \",AA835,1)+1,FIND(\"(\",AA835,1)-FIND(\" \",AA835,1)-2)),\"\",MID(AA835,FIND(\" \",AA835,1)+1,FIND(\"(\",AA835,1)-FIND(\" \",AA835,1)-2)))","v":""}]
[{"$nulls":13},{"$f":"IF(M836=\"\",\"\",IF(ISERROR(LEFT(M836,FIND(\"-\",M836)-1)),IF(ISERROR(LEFT(M836,FIND(\" \",M836)-1)),M836,LEFT(M836,FIND(\" \",M836)-1)),LEFT(M836,FIND(\"-\",M836)-1)))","v":""},{"$nulls":11},""]
[{"$nulls":13},"",{"$nulls":11},""]
[{"$nulls":13},"",{"$nulls":11},""]
[{"$nulls":13},"",{"$nulls":11},""]
[{"$nulls":13},"",{"$nulls":11},""]
[{"$nulls":13},"",{"$nulls":11},""]
[{"$nulls":13},"",{"$nulls":11},""]
[{"$nulls":13},"",{"$nulls":11},""]
[{"$nulls":13},"",{"$nulls":11},""]
[{"$nulls":13},"",{"$nulls":11},""]
[{"$nulls":13},"",{"$nulls":11},""]
[{"$nulls":13},"",{"$nulls":11},""]
[{"$nulls":13},"",{"$nulls":11},""]
[{"$nulls":13},"",{"$nulls":11},""]
[{"$nulls":13},"",{"$nulls":11},""]
[{"$nulls":13},"",{"$nulls":11},""]
[{"$nulls":13},"",{"$nulls":11},""]
[{"$nulls":13},"",{"$nulls":11},""]
[{"$nulls":13},"",{"$nulls":11},""]
[{"$nulls":13},"",{"$nulls":11},""]
[{"$nulls":13},"",{"$nulls":11},""]
[{"$nulls":13},"",{"$nulls":11},""]
[{"$nulls":13},"",{"$nulls":11},""]
[{"$nulls":13},"",{"$nulls":11},""]
[{"$nulls":13},"",{"$nulls":11},""]
[{"$nulls":13},"",{"$nulls":11},""]
[{"$nulls":13},"",{"$nulls":11},""]
[{"$nulls":13},"",{"$nulls":11},""]
[{"$nulls":13},"",{"$nulls":11},""]
[{"$nulls":13},"",{"$nulls":11},""]
[{"$nulls":13},"",{"$nulls":11},""]
[{"$nulls":13},"",{"$nulls":11},""]
[{"$nulls":13},"",{"$nulls":11},""]
[{"$nulls":13},"",{"$nulls":11},""]
[{"$nulls":13},"",{"$nulls":11},""]
[{"$nulls":13},"",{"$nulls":11},""]
[{"$nulls":13},"",{"$nulls":11},""]
[{"$nulls":13},"",{"$nulls":11},""]
[{"$nulls":13},"",{"$nulls":11},""]
[{"$nulls":13},"",{"$nulls":11},""]
[{"$nulls":13},"",{"$nulls":11},""]
[{"$nulls":13},"",{"$nulls":11},""]
[{"$nulls":13},"",{"$nulls":11},""]
[{"$nulls":13},"",{"$nulls":11},""]
[{"$nulls":13},"",{"$nulls":11},""]
[{"$nulls":13},"",{"$nulls":11},""]
[{"$nulls":13},"",{"$nulls":11},""]
[{"$nulls":13},"",{"$nulls":11},""]
[{"$nulls":13},"",{"$nulls":11},""]
[{"$nulls":13},"",{"$nulls":11},""]
[{"$nulls":13},"",{"$nulls":11},""]
[{"$nulls":13},"",{"$nulls":11},""]
[{"$nulls":13},"",{"$nulls":11},""]
[{"$nulls":13},"",{"$nulls":11},""]
[{"$nulls":13},"",{"$nulls":11},""]
[{"$nulls":13},"",{"$nulls":11},""]
[{"$nulls":13},"",{"$nulls":11},""]
[{"$nulls":13},"",{"$nulls":11},""]
[{"$nulls":13},"",{"$nulls":11},""]
[{"$nulls":13},"",{"$nulls":11},""]
[{"$nulls":13},"",{"$nulls":11},""]
[{"$nulls":13},"",{"$nulls":11},""]
[{"$nulls":13},"",{"$nulls":11},""]
[{"$nulls":13},"",{"$nulls":11},{"$f":"IF(AA899=\"\",\"\",IF(ISERROR(MID(AA899,FIND(\" \",AA899,1)+1,FIND(\"(\",AA899,1)-FIND(\" \",AA899,1)-2)),\"\",MID(AA899,FIND(\" \",AA899,1)+1,FIND(\"(\",AA899,1)-FIND(\" \",AA899,1)-2)))","v":""}]
[{"$nulls":13},{"$f":"IF(M900=\"\",\"\",IF(ISERROR(LEFT(M900,FIND(\"-\",M900)-1)),IF(ISERROR(LEFT(M900,FIND(\" \",M900)-1)),M900,LEFT(M900,FIND(\" \",M900)-1)),LEFT(M900,FIND(\"-\",M900)-1)))","v":""},{"$nulls":11},""]
[{"$nulls":13},"",{"$nulls":11},""]
[{"$nulls":13},"",{"$nulls":11},""]
[{"$nulls":13},"",{"$nulls":11},""]
[{"$nulls":13},"",{"$nulls":11},""]
[{"$nulls":13},"",{"$nulls":11},""]
[{"$nulls":13},"",{"$nulls":11},""]
[{"$nulls":13},"",{"$nulls":11},""]
[{"$nulls":13},"",{"$nulls":11},""]
[{"$nulls":13},"",{"$nulls":11},""]
[{"$nulls":13},"",{"$nulls":11},""]
[{"$nulls":13},"",{"$nulls":11},""]
[{"$nulls":13},"",{"$nulls":11},""]
[{"$nulls":13},"",{"$nulls":11},""]
[{"$nulls":13},"",{"$nulls":11},""]
[{"$nulls":13},"",{"$nulls":11},""]
[{"$nulls":13},"",{"$nulls":11},""]
[{"$nulls":13},"",{"$nulls":11},""]
[{"$nulls":13},"",{"$nulls":11},""]
[{"$nulls":13},"",{"$nulls":11},""]
[{"$nulls":13},"",{"$nulls":11},""]
[{"$nulls":13},"",{"$nulls":11},""]
[{"$nulls":13},"",{"$nulls":11},""]
[{"$nulls":13},"",{"$nulls":11},""]
[{"$nulls":13},"",{"$nulls":11},""]
[{"$nulls":13},"",{"$nulls":11},""]
[{"$nulls":13},"",{"$nulls":11},""]
[{"$nulls":13},"",{"$nulls":11},""]
[{"$nulls":13},"",{"$nulls":11},""]
[{"$nulls":13},"",{"$nulls":11},""]
[{"$nulls":13},"",{"$nulls":11},""]
[{"$nulls":13},"",{"$nulls":11},""]
[{"$nulls":13},"",{"$nulls":11},""]
[{"$nulls":13},"",{"$nulls":11},""]
[{"$nulls":13},"",{"$nulls":11},""]
[{"$nulls":13},"",{"$nulls":11},""]
[{"$nulls":13},"",{"$nulls":11},""]
[{"$nulls":13},"",{"$nulls":11},""]
[{"$nulls":13},"",{"$nulls":11},""]
[{"$nulls":13},"",{"$nulls":11},""]
[{"$nulls":13},"",{"$nulls":11},""]
[{"$nulls":13},"",{"$nulls":11},""]
[{"$nulls":13},"",{"$nulls":11},""]
[{"$nulls":13},"",{"$nulls":11},""]
[{"$nulls":13},"",{"$nulls":11},""]
[{"$nulls":13},"",{"$nulls":11},""]
[{"$nulls":13},"",{"$nulls":11},""]
[{"$nulls":13},"",{"$nulls":11},""]
[{"$nulls":13},"",{"$nulls":11},""]
[{"$nulls":13},"",{"$nulls":11},""]
[{"$nulls":13},"",{"$nulls":11},""]
[{"$nulls":13},"",{"$nulls":11},""]
[{"$nulls":13},"",{"$nulls":11},""]
[{"$nulls":13},"",{"$nulls":11},""]
[{"$nulls":13},"",{"$nulls":11},""]
[{"$nulls":13},"",{"$nulls":11},""]
[{"$nulls":13},"",{"$nulls":11},""]
[{"$nulls":13},"",{"$nulls":11},""]
[{"$nulls":13},"",{"$nulls":11},""]
[{"$nulls":13},"",{"$nulls":11},""]
[{"$nulls":13},"",{"$nulls":11},""]
[{"$nulls":13},"",{"$nulls":11},""]
[{"$nulls":13},"",{"$nulls":11},""]
[{"$nulls":13},"",{"$nulls":11},{"$f":"IF(AA963=\"\",\"\",IF(ISERROR(MID(AA963,FIND(\" \",AA963,1)+1,FIND(\"(\",AA963,1)-FIND(\" \",AA963,1)-2)),\"\",MID(AA963,FIND(\" \",AA963,1)+1,FIND(\"(\",AA963,1)-FIND(\" \",AA963,1)-2)))","v":""}]
[{"$nulls":13},{"$f":"IF(M964=\"\",\"\",IF(ISERROR(LEFT(M964,FIND(\"-\",M964)-1)),IF(ISERROR(LEFT(M964,FIND(\" \",M964)-1)),M964,LEFT(M964,FIND(\" \",M964)-1)),LEFT(M964,FIND(\"-\",M964)-1)))","v":""},{"$nulls":11},""]
[{"$nulls":13},"",{"$nulls":11},""]
[{"$nulls":13},"",{"$nulls":11},""]
[{"$nulls":13},"",{"$nulls":11},""]
[{"$nulls":13},"",{"$nulls":11},""]
[{"$nulls":13},"",{"$nulls":11},""]
[{"$nulls":13},"",{"$nulls":11},""]
[{"$nulls":13},"",{"$nulls":11},""]
[{"$nulls":13},"",{"$nulls":11},""]
[{"$nulls":13},"",{"$nulls":11},""]
[{"$nulls":13},"",{"$nulls":11},""]
[{"$nulls":13},"",{"$nulls":11},""]
[{"$nulls":13},"",{"$nulls":11},""]
[{"$nulls":13},"",{"$nulls":11},""]
[{"$nulls":13},"",{"$nulls":11},""]
[{"$nulls":13},"",{"$nulls":11},""]
[{"$nulls":13},"",{"$nulls":11},""]
[{"$nulls":13},"",{"$nulls":11},""]
[{"$nulls":13},"",{"$nulls":11},""]
[{"$nulls":13},"",{"$nulls":11},""]
[{"$nulls":13},"",{"$nulls":11},""]
[{"$nulls":13},"",{"$nulls":11},""]
[{"$nulls":13},"",{"$nulls":11},""]
[{"$nulls":13},"",{"$nulls":11},""]
[{"$nulls":13},"",{"$nulls":11},""]
[{"$nulls":13},"",{"$nulls":11},""]
[{"$nulls":13},"",{"$nulls":11},""]
[{"$nulls":13},"",{"$nulls":11},""]
[{"$nulls":13},"",{"$nulls":11},""]
[{"$nulls":13},"",{"$nulls":11},""]
[{"$nulls":13},"",{"$nulls":11},""]
[{"$nulls":13},"",{"$nulls":11},""]
[{"$nulls":13},"",{"$nulls":11},""]
[{"$nulls":13},"",{"$nulls":11},""]
[{"$nulls":13},"",{"$nulls":11},""]
[{"$nulls":13},"",{"$nulls":11},""]
[{"$nulls":13},"",{"$nulls":11},""]
[{"$nulls":13},"",{"$nulls":11},""]
[{"$nulls":13},"",{"$nulls":11},""]
[{"$nulls":13},"",{"$nulls":11},""]
[{"$nulls":13},"",{"$nulls":11},""]
[{"$nulls":13},"",{"$nulls":11},""]
[{"$nulls":13},"",{"$nulls":11},""]
[{"$nulls":13},"",{"$nulls":11},""]
[{"$nulls":13},"",{"$nulls":11},""]
[{"$nulls":13},"",{"$nulls":11},""]
[{"$nulls":13},"",{"$nulls":11},""]
[{"$nulls":13},"",{"$nulls":11},""]
[{"$nulls":13},"",{"$nulls":11},""]
[{"$nulls":13},"",{"$nulls":11},""]
[{"$nulls":13},"",{"$nulls":11},""]
[{"$nulls":13},"",{"$nulls":11},""]
[{"$nulls":13},"",{"$nulls":11},""]
[{"$nulls":13},"",{"$nulls":11},""]
[{"$nulls":13},"",{"$nulls":11},""]
[{"$nulls":13},"",{"$nulls":11},""]
[{"$nulls":13},"",{"$nulls":11},""]
[{"$nulls":13},"",{"$nulls":11},""]
[{"$nulls":13},"",{"$nulls":11},""]
[{"$nulls":13},"",{"$nulls":11},""]
[{"$nulls":13},"",{"$nulls":11},""]
[{"$nulls":13},"",{"$nulls":11},""]
[{"$nulls":13},"",{"$nulls":11},""]
[{"$nulls":13},"",{"$nulls":11},{"$f":"IF(AA1027=\"\",\"\",IF(ISERROR(MID(AA1027,FIND(\" \",AA1027,1)+1,FIND(\"(\",AA1027,1)-FIND(\" \",AA1027,1)-2)),\"\",MID(AA1027,FIND(\" \",AA1027,1)+1,FIND(\"(\",AA1027,1)-FIND(\" \",AA1027,1)-2)))","v":""}]
[{"$nulls":13},{"$f":"IF(M1028=\"\",\"\",IF(ISERROR(LEFT(M1028,FIND(\"-\",M1028)-1)),IF(ISERROR(LEFT(M1028,FIND(\" \",M1028)-1)),M1028,LEFT(M1028,FIND(\" \",M1028)-1)),LEFT(M1028,FIND(\"-\",M1028)-1)))","v":""},{"$nulls":11},""]
[{"$nulls":13},"",{"$nulls":11},""]
[{"$nulls":13},"",{"$nulls":11},""]
[{"$nulls":13},"",{"$nulls":11},""]
[{"$nulls":13},"",{"$nulls":11},""]
[{"$nulls":13},"",{"$nulls":11},""]
[{"$nulls":13},"",{"$nulls":11},""]
[{"$nulls":13},"",{"$nulls":11},""]
[{"$nulls":13},"",{"$nulls":11},""]
[{"$nulls":13},"",{"$nulls":11},""]
[{"$nulls":13},"",{"$nulls":11},""]
[{"$nulls":13},"",{"$nulls":11},""]
[{"$nulls":13},"",{"$nulls":11},""]
[{"$nulls":13},"",{"$nulls":11},""]
[{"$nulls":13},"",{"$nulls":11},""]
[{"$nulls":13},"",{"$nulls":11},""]
[{"$nulls":13},"",{"$nulls":11},""]
[{"$nulls":13},"",{"$nulls":11},""]
[{"$nulls":13},"",{"$nulls":11},""]
[{"$nulls":13},"",{"$nulls":11},""]
[{"$nulls":13},"",{"$nulls":11},""]
[{"$nulls":13},"",{"$nulls":11},""]
[{"$nulls":13},"",{"$nulls":11},""]
[{"$nulls":13},"",{"$nulls":11},""]
[{"$nulls":13},"",{"$nulls":11},""]
[{"$nulls":13},"",{"$nulls":11},""]
[{"$nulls":13},"",{"$nulls":11},""]
[{"$nulls":13},"",{"$nulls":11},""]
[{"$nulls":13},"",{"$nulls":11},""]
[{"$nulls":13},"",{"$nulls":11},""]
[{"$nulls":13},"",{"$nulls":11},""]
[{"$nulls":13},"",{"$nulls":11},""]
[{"$nulls":13},"",{"$nulls":11},""]
[{"$nulls":13},"",{"$nulls":11},""]
[{"$nulls":13},"",{"$nulls":11},""]
[{"$nulls":13},"",{"$nulls":11},""]
[{"$nulls":13},"",{"$nulls":11},""]
[{"$nulls":13},"",{"$nulls":11},""]
[{"$nulls":13},"",{"$nulls":11},""]
[{"$nulls":13},"",{"$nulls":11},""]
[{"$nulls":13},"",{"$nulls":11},""]
[{"$nulls":13},"",{"$nulls":11},""]
[{"$nulls":13},"",{"$nulls":11},""]
[{"$nulls":13},"",{"$nulls":11},""]
[{"$nulls":13},"",{"$nulls":11},""]
[{"$nulls":13},"",{"$nulls":11},""]
[{"$nulls":13},"",{"$nulls":11},""]
[{"$nulls":13},"",{"$nulls":11},""]
[{"$nulls":13},"",{"$nulls":11},""]
[{"$nulls":13},"",{"$nulls":11},""]
[{"$nulls":13},"",{"$nulls":11},""]
[{"$nulls":13},"",{"$nulls":11},""]
[{"$nulls":13},"",{"$nulls":11},""]
[{"$nulls":13},"",{"$nulls":11},""]
[{"$nulls":13},"",{"$nulls":11},""]
[{"$nulls":13},"",{"$nulls":11},""]
[{"$nulls":13},"",{"$nulls":11},""]
[{"$nulls":13},"",{"$nulls":11},""]
[{"$nulls":13},"",{"$nulls":11},""]
[{"$nulls":13},"",{"$nulls":11},""]
[{"$nulls":13},"",{"$nulls":11},""]
[{"$nulls":13},"",{"$nulls":11},""]
[{"$nulls":13},"",{"$nulls":11},""]
[{"$nulls":13},"",{"$nulls":11},{"$f":"IF(AA1091=\"\",\"\",IF(ISERROR(MID(AA1091,FIND(\" \",AA1091,1)+1,FIND(\"(\",AA1091,1)-FIND(\" \",AA1091,1)-2)),\"\",MID(AA1091,FIND(\" \",AA1091,1)+1,FIND(\"(\",AA1091,1)-FIND(\" \",AA1091,1)-2)))","v":""}]
[{"$nulls":13},{"$f":"IF(M1092=\"\",\"\",IF(ISERROR(LEFT(M1092,FIND(\"-\",M1092)-1)),IF(ISERROR(LEFT(M1092,FIND(\" \",M1092)-1)),M1092,LEFT(M1092,FIND(\" \",M1092)-1)),LEFT(M1092,FIND(\"-\",M1092)-1)))","v":""},{"$nulls":11},""]
[{"$nulls":13},"",{"$nulls":11},""]
[{"$nulls":13},"",{"$nulls":11},""]
[{"$nulls":13},"",{"$nulls":11},""]
[{"$nulls":13},"",{"$nulls":11},""]
[{"$nulls":13},"",{"$nulls":11},""]
[{"$nulls":13},"",{"$nulls":11},""]
[{"$nulls":13},"",{"$nulls":11},""]
[{"$nulls":13},"",{"$nulls":11},""]
[{"$nulls":13},"",{"$nulls":11},""]
[{"$nulls":13},"",{"$nulls":11},""]
[{"$nulls":13},"",{"$nulls":11},""]
[{"$nulls":13},"",{"$nulls":11},""]
[{"$nulls":13},"",{"$nulls":11},""]
[{"$nulls":13},"",{"$nulls":11},""]
[{"$nulls":13},"",{"$nulls":11},""]
[{"$nulls":13},"",{"$nulls":11},""]
[{"$nulls":13},"",{"$nulls":11},""]
[{"$nulls":13},"",{"$nulls":11},""]
[{"$nulls":13},"",{"$nulls":11},""]
[{"$nulls":13},"",{"$nulls":11},""]
[{"$nulls":13},"",{"$nulls":11},""]
[{"$nulls":13},"",{"$nulls":11},""]
[{"$nulls":13},"",{"$nulls":11},""]
[{"$nulls":13},"",{"$nulls":11},""]
[{"$nulls":13},"",{"$nulls":11},""]
[{"$nulls":13},"",{"$nulls":11},""]
[{"$nulls":13},"",{"$nulls":11},""]
[{"$nulls":13},"",{"$nulls":11},""]
[{"$nulls":13},"",{"$nulls":11},""]
[{"$nulls":13},"",{"$nulls":11},""]
[{"$nulls":13},"",{"$nulls":11},""]
[{"$nulls":13},"",{"$nulls":11},""]
[{"$nulls":13},"",{"$nulls":11},""]
[{"$nulls":13},"",{"$nulls":11},""]
[{"$nulls":13},"",{"$nulls":11},""]
[{"$nulls":13},"",{"$nulls":11},""]
[{"$nulls":13},"",{"$nulls":11},""]
[{"$nulls":13},"",{"$nulls":11},""]
[{"$nulls":13},"",{"$nulls":11},""]
[{"$nulls":13},"",{"$nulls":11},""]
[{"$nulls":13},"",{"$nulls":11},""]
[{"$nulls":13},"",{"$nulls":11},""]
[{"$nulls":13},"",{"$nulls":11},""]
[{"$nulls":13},"",{"$nulls":11},""]
[{"$nulls":13},"",{"$nulls":11},""]
[{"$nulls":13},"",{"$nulls":11},""]
[{"$nulls":13},"",{"$nulls":11},""]
[{"$nulls":13},"",{"$nulls":11},""]
[{"$nulls":13},"",{"$nulls":11},""]
[{"$nulls":13},"",{"$nulls":11},""]
[{"$nulls":13},"",{"$nulls":11},""]
[{"$nulls":13},"",{"$nulls":11},""]
[{"$nulls":13},"",{"$nulls":11},""]
[{"$nulls":13},"",{"$nulls":11},""]
[{"$nulls":13},"",{"$nulls":11},""]
[{"$nulls":13},"",{"$nulls":11},""]
[{"$nulls":13},"",{"$nulls":11},""]
[{"$nulls":13},"",{"$nulls":11},""]
[{"$nulls":13},"",{"$nulls":11},""]
[{"$nulls":13},"",{"$nulls":11},""]
[{"$nulls":13},"",{"$nulls":11},""]
[{"$nulls":13},"",{"$nulls":11},""]
[{"$nulls":13},"",{"$nulls":11},{"$f":"IF(AA1155=\"\",\"\",IF(ISERROR(MID(AA1155,FIND(\" \",AA1155,1)+1,FIND(\"(\",AA1155,1)-FIND(\" \",AA1155,1)-2)),\"\",MID(AA1155,FIND(\" \",AA1155,1)+1,FIND(\"(\",AA1155,1)-FIND(\" \",AA1155,1)-2)))","v":""}]
[{"$nulls":13},{"$f":"IF(M1156=\"\",\"\",IF(ISERROR(LEFT(M1156,FIND(\"-\",M1156)-1)),IF(ISERROR(LEFT(M1156,FIND(\" \",M1156)-1)),M1156,LEFT(M1156,FIND(\" \",M1156)-1)),LEFT(M1156,FIND(\"-\",M1156)-1)))","v":""},{"$nulls":11},""]
[{"$nulls":13},"",{"$nulls":11},""]
[{"$nulls":13},"",{"$nulls":11},""]
[{"$nulls":13},"",{"$nulls":11},""]
[{"$nulls":13},"",{"$nulls":11},""]
[{"$nulls":13},"",{"$nulls":11},""]
[{"$nulls":13},"",{"$nulls":11},""]