{"text_format":"2","workbook":"xlsx","n_sheets":4,"sheets":["RaceCard","Review","Schedule","Start here"],"not_rendered":{"charts":0,"images":1,"macros":1,"external_links":0,"defined_names":3,"comments":1,"pivot_tables":0},"unopened":[],"bounds":{"document_bytes":16777216,"sheet_cells":100000,"run_cost":"one","rows_first":2000,"rows_last":500,"rows_between":2000,"halvings":0,"cell_chars":16384,"cell_head_chars":4096},"cells_cut":0,"cells_raw":0,"read":"whole","date_system":"1900"}

{"sheet":"RaceCard","index":0,"n_rows":37,"n_cols":27,"rows_kept":37,"cut":false,"hidden":false,"merged":[]}
["Code","Track","Track Condition","Track Rating",null,null,"Weather",{"$nulls":5},"TAB","Name","Weight","Jockey","Win Types","BP","L3S","Q Rating","Last Odds","Win$","Plc$","LFP1","LFP2","LFP3","Q Rating Rank"]
["NR","Tamworth","Dead",7,4,1,"Fine","N",{"$nulls":4},1,"EFFJAYCANNY",59,null,null,14,422,87,1638.35,1638.35,1638.35,{"$f":"IF(OR($V2=0,$V2=\"\",$V2>1000),\"\",IF(S2=\"\",0,RIGHT(S2,1)))","v":""},{"$f":"IF(OR($V2=0,$V2=\"\",$V2>1000),\"\",IF(LEN(S2)=0,0,IF(LEN(S2)=1,0,IF(LEN(S2)=2,LEFT(S2,1),IF(LEN(S2)=3,MID(S2,2,1))))))","v":""},{"$f":"IF(OR($V2=0,$V2=\"\",$V2>1000),\"\",IF(LEN(S2)=0,0,IF(LEN(S2)=1,0,IF(OR(LEN(S2)=2,LEN(S2)=1),\"\",LEFT(S2,1)))))","v":""},{"$f":"IF(OR($V2=0,$V2=\"\",$V2>1000),\"\",RANK(T2,T$2:T$25)+COUNTIF(T$2:T2,T2)-1)","v":""}]
["Race No.","Jump Time","Race Name","Distance","Status",{"$nulls":5},"Time",null,2,"GEE I GEORGE",59,"M BROWN(A)",null,1,"0X5",78,49.1,13.1,13.7,{"$f":"IF(OR($V3=0,$V3=\"\",$V3>1000),\"\",IF(S3=\"\",0,RIGHT(S3,1)))","v":"5"},{"$f":"IF(OR($V3=0,$V3=\"\",$V3>1000),\"\",IF(LEN(S3)=0,0,IF(LEN(S3)=1,0,IF(LEN(S3)=2,LEFT(S3,1),IF(LEN(S3)=3,MID(S3,2,1))))))","v":"X"},{"$f":"IF(OR($V3=0,$V3=\"\",$V3>1000),\"\",IF(LEN(S3)=0,0,IF(LEN(S3)=1,0,IF(OR(LEN(S3)=2,LEN(S3)=1),\"\",LEFT(S3,1)))))","v":"0"},{"$f":"IF(OR($V3=0,$V3=\"\",$V3>1000),\"\",RANK(T3,T$2:T$25)+COUNTIF(T$2:T3,T3)-1)","v":13}]
[1,"2012-12-24T12:23:00","MAIDEN PLATE",1000,"SELLING",{"$nulls":5},{"$f":"TIMEVALUE(RIGHT(B4,8))","v":"12:23:00"},null,3,"GOLDEN STITCH",59,"S THURLOW",null,13,"00X",78,16.3,17.5,13.7,"X","0","0",{"$f":"IF(OR($V4=0,$V4=\"\",$V4>1000),\"\",RANK(T4,T$2:T$25)+COUNTIF(T$2:T4,T4)-1)","v":14}]
["Tipster","Tips 1","Tips 2","Tips 3","Tips 4",{"$nulls":7},4,"OUR DANCER",59,"M PAGET",null,8,"85X",79,8.9,14.3,5.4,"X","5","8",{"$f":"IF(OR($V5=0,$V5=\"\",$V5>1000),\"\",RANK(T5,T$2:T$25)+COUNTIF(T$2:T5,T5)-1)","v":12}]
[{"$nulls":12},5,"SNIPPET EXPRESS",59,"M DRACOS",null,6,"60X",93,12.2,14.3,13.7,"X","0","6",{"$f":"IF(OR($V6=0,$V6=\"\",$V6>1000),\"\",RANK(T6,T$2:T$25)+COUNTIF(T$2:T6,T6)-1)","v":3}]
["RADIO TAB","10-11-5",{"$nulls":10},6,"TAKIRI",59,"DARREN JONES",null,7,67,87,19.600000000000001,31.6,6.8,"7","6","",{"$f":"IF(OR($V7=0,$V7=\"\",$V7>1000),\"\",RANK(T7,T$2:T$25)+COUNTIF(T$2:T7,T7)-1)","v":7}]
[{"$nulls":12},7,"GOLD ARMANI",57,"R THOMPSON",null,4,50,100,3.9,6.3,1.9,{"$f":"IF(OR($V8=0,$V8=\"\",$V8>1000),\"\",IF(S8=\"\",0,RIGHT(S8,1)))","v":"0"},{"$f":"IF(OR($V8=0,$V8=\"\",$V8>1000),\"\",IF(LEN(S8)=0,0,IF(LEN(S8)=1,0,IF(LEN(S8)=2,LEFT(S8,1),IF(LEN(S8)=3,MID(S8,2,1))))))","v":"5"},"",{"$f":"IF(OR($V8=0,$V8=\"\",$V8>1000),\"\",RANK(T8,T$2:T$25)+COUNTIF(T$2:T8,T8)-1)","v":1}]
[{"$f":"IF(B6=\"\",\"\",A6)","v":""},{"$f":"IF(B6=\"\",\"\",IF(LEFT(B6,1)=\"*\",MID(B6,2,100),B6))","v":""},{"$nulls":10},8,"MAKE ME SOME",57,"C VAN DER WERF(A)",null,15,455,89,1638.35,1638.35,1638.35,"","","",{"$f":"IF(OR($V9=0,$V9=\"\",$V9>1000),\"\",RANK(T9,T$2:T$25)+COUNTIF(T$2:T9,T9)-1)","v":""}]
[{"$f":"IF(B7=\"\",\"\",A7)","v":"RADIO TAB"},{"$f":"IF(B7=\"\",\"\",IF(LEFT(B7,1)=\"*\",MID(B7,2,100),B7))","v":"10-11-5"},{"$nulls":10},9,"SILENT WINN",57,"S BIGG(A)",null,10,"0X4",85,98.3,26.3,5.4,"4","X","0",{"$f":"IF(OR($V10=0,$V10=\"\",$V10>1000),\"\",RANK(T10,T$2:T$25)+COUNTIF(T$2:T10,T10)-1)","v":8}]
["","",{"$nulls":10},10,"SUGARED ALMOND",57,"SHANE ARNOLD(A)",null,2,"X73",98,9.8000000000000007,3.9,1.3,"3","7","X",{"$f":"IF(OR($V11=0,$V11=\"\",$V11>1000),\"\",RANK(T11,T$2:T$25)+COUNTIF(T$2:T11,T11)-1)","v":2}]
["LATE MAIL",{"$nulls":11},11,"THE LIONS SHARE",57,"PATRICK LO(A)",null,12,"32X",84,8.1,8.3000000000000007,1.5,"X","2","3",{"$f":"IF(OR($V12=0,$V12=\"\",$V12>1000),\"\",RANK(T12,T$2:T$25)+COUNTIF(T$2:T12,T12)-1)","v":9}]
["RADIO TAB",10,11,5,{"$nulls":8},12,"TRIDANESCAY",57,"M POWELL(A)",null,11,"0X9",78,49.1,52.7,6.8,"9","X","0",{"$f":"IF(OR($V13=0,$V13=\"\",$V13>1000),\"\",RANK(T13,T$2:T$25)+COUNTIF(T$2:T13,T13)-1)","v":15}]
[{"$nulls":12},13,"VESTALIA",57,"L G HENRY",null,3,"3X3",93,3.1,4.5999999999999996,1.6,"3","X","3",{"$f":"IF(OR($V14=0,$V14=\"\",$V14>1000),\"\",RANK(T14,T$2:T$25)+COUNTIF(T$2:T14,T14)-1)","v":4}]
["Type","Available","Last Update","Status","Update Time","Last Update","Update Time","Time Diff",{"$nulls":4},14,"WITCHY WOMEN",57,"B LOOKER",null,5,"7X",83,49.1,15.8,9.1,"X","7","",{"$f":"IF(OR($V15=0,$V15=\"\",$V15>1000),\"\",RANK(T15,T$2:T$25)+COUNTIF(T$2:T15,T15)-1)","v":11}]
[null,"Y","2012-01-01T17:08:38","SELLING","2012-01-01T17:20:35","EX","Y","2012-12-24T07:58:49","SELLING","2012-12-24T08:59:05",null,null,15,"LE QUESNAY",59,"JESSICA TAYLOR(A)",null,9,"0X4",84,0,0,0,"","","",{"$f":"IF(OR($V16=0,$V16=\"\",$V16>1000),\"\",RANK(T16,T$2:T$25)+COUNTIF(T$2:T16,T16)-1)","v":""}]
["Pool","Div","Leg1","Leg2",{"$nulls":19},"","","",{"$f":"IF(OR($V17=0,$V17=\"\",$V17>1000),\"\",RANK(T17,T$2:T$25)+COUNTIF(T$2:T17,T17)-1)","v":""}]
[35,9.3000000000000007,3,2,{"$nulls":19},"","","",{"$f":"IF(OR($V18=0,$V18=\"\",$V18>1000),\"\",RANK(T18,T$2:T$25)+COUNTIF(T$2:T18,T18)-1)","v":""}]
["Type","Available","Last Update","Status","Update Time","Last Update","Update Time","Time Diff",{"$nulls":15},"","","",{"$f":"IF(OR($V19=0,$V19=\"\",$V19>1000),\"\",RANK(T19,T$2:T$25)+COUNTIF(T$2:T19,T19)-1)","v":""}]
[{"$nulls":4},"QN","Y","2012-12-24T07:58:49","SELLING","2012-12-24T08:59:05",{"$nulls":14},"","","",{"$f":"IF(OR($V20=0,$V20=\"\",$V20>1000),\"\",RANK(T20,T$2:T$25)+COUNTIF(T$2:T20,T20)-1)","v":""}]
["Pool","Div","Leg1","Leg2",{"$nulls":19},"","","",{"$f":"IF(OR($V21=0,$V21=\"\",$V21>1000),\"\",RANK(T21,T$2:T$25)+COUNTIF(T$2:T21,T21)-1)","v":""}]
[21,2.4,2,3,{"$nulls":19},"","","",{"$f":"IF(OR($V22=0,$V22=\"\",$V22>1000),\"\",RANK(T22,T$2:T$25)+COUNTIF(T$2:T22,T22)-1)","v":""}]
["Type","Available","Last Update","Status","Update Time","Last Update","Update Time","Time Diff",{"$nulls":15},"","","",{"$f":"IF(OR($V23=0,$V23=\"\",$V23>1000),\"\",RANK(T23,T$2:T$25)+COUNTIF(T$2:T23,T23)-1)","v":""}]
[{"$nulls":5},"TF","Y","2012-12-24T07:58:49","SELLING","2012-12-24T08:59:05",{"$nulls":13},"","","",{"$f":"IF(OR($V24=0,$V24=\"\",$V24>1000),\"\",RANK(T24,T$2:T$25)+COUNTIF(T$2:T24,T24)-1)","v":""}]
["Pool","Div","Leg1","Leg2","Leg3",{"$nulls":18},"","","",{"$f":"IF(OR($V25=0,$V25=\"\",$V25>1000),\"\",RANK(T25,T$2:T$25)+COUNTIF(T$2:T25,T25)-1)","v":""}]
[50,62.1,3,2,6]
["Type","Available","Last Update","Status","Update Time","Last Update","Update Time","Time Diff"]
[{"$nulls":5},{"$f":"IF(C28=\"\",\"\",TIMEVALUE(RIGHT(C28,8)))","v":""},"F4","Y","2012-12-23T12:05:49","PAYING","2012-12-23T12:09:53"]
["Pool","Div","Leg1","Leg2","Leg3","Leg4"]
[]
["Pool","Div","Leg1","Leg2","Leg3","Leg4"]
[]
["Pool","Div","Leg1","Leg2","Leg3","Leg4"]
[]
["Pool","Div","Leg1","Leg2","Leg3","Leg4"]
[]
["Pool","Div","Leg1","Leg2","Leg3","Leg4"]

{"sheet":"Review","index":1,"n_rows":301,"n_cols":35,"rows_kept":301,"cut":false,"hidden":false,"merged":[[0,9,0,11],[1,9,1,11]]}
["2012-12-24","Code","Track","Race","Mtrs","Field","Cond","Jump","Now","Race Name",{"$nulls":6},"TF Pool","WIN Pool",null,"ID","Picklist Value","MeetingType","RaceTime","VenueName","MeetingCode","RaceNo",null,null,"Date","Year","Month","Day","Venue","Race","Race2"]
[23,{"$f":"CONCATENATE(VLOOKUP(A2,$T$2:$Z$301,6,FALSE),VLOOKUP(A2,$T$2:$Z$301,7,FALSE))","v":"NR1"},{"$f":"VLOOKUP(A2,$T$2:$Z$301,5,FALSE)","v":"Tamworth"},{"$f":"VLOOKUP(A2,$T$2:$Z$301,7,FALSE)","v":1},{"$f":"VALUE(RaceCard!D4)","v":1000},{"$f":"COUNTIF(RaceCard!AA2:AA25,\">0\")","v":12},{"$f":"RaceCard!C2","v":"Dead"},{"$f":"TEXT(VLOOKUP(A2,T2:Z301,4,FALSE),\"HH:MM AM/PM\")","v":"12:23 PM"},{"$f":"NOW()+TIME(0,30,0)","v":41267.444640740745},{"$f":"RaceCard!C4","v":"MAIDEN PLATE"},{"$nulls":6},{"$f":"RaceCard!A26","v":50},null,null,1,{"$f":"IF(V2=\"\",\"\",CONCATENATE(TEXT(W2,\"HH:MM AM/PM\"),\"-\",X2,\"-\",Z2,\" (\",V2,\")\"))","v":"09:01 AM-Cambridge-1 (G)"},{"$f":"IF(Schedule!A2=\"\",\"\",(Schedule!A2))","v":"G"},{"$f":"IF(Schedule!B2=\"\",\"\",TEXT(Schedule!B2,\"HH:MM AM/PM\"))","v":"09:01 AM"},{"$f":"IF(Schedule!C2=\"\",\"\",(Schedule!C2))","v":"Cambridge"},{"$f":"IF(Schedule!D2=\"\",\"\",(Schedule!D2))","v":"OG"},{"$f":"IF(Schedule!E2=\"\",\"\",(Schedule!E2))","v":1},null,null,{"$f":"TEXT($A$1,\"yyyy/m/d\")","v":"2012/12/24"},{"$f":"TEXT($A1,\"yyyy\")","v":"2012"},{"$f":"TEXT(A1,\"m\")","v":"12"},{"$f":"TEXT($A1,\"d\")","v":"24"},{"$f":"IF(H2=\"\",\"\",VLOOKUP($A2,$T$2:$Z$301,6,FALSE))","v":"NR"},{"$f":"D2","v":1},{"$f":"CONCATENATE(AG2,TEXT(AH2,\"0\"))","v":"NR1"}]
[null,"TAB","Name","Win Odds","Plc Odds","Last Odds","Odds +/-","Weight","QTP","Tipster","Qrating","Late Mail","LS3 Form","LS1","LS2","LS3","Form","Jockey",null,2,{"$f":"IF(V3=\"\",\"\",CONCATENATE(TEXT(W3,\"HH:MM AM/PM\"),\"-\",X3,\"-\",Z3,\" (\",V3,\")\"))","v":"09:18 AM-Cambridge-2 (G)"},{"$f":"IF(Schedule!A3=\"\",\"\",(Schedule!A3))","v":"G"},{"$f":"IF(Schedule!B3=\"\",\"\",TEXT(Schedule!B3,\"HH:MM AM/PM\"))","v":"09:18 AM"},{"$f":"IF(Schedule!C3=\"\",\"\",(Schedule!C3))","v":"Cambridge"},{"$f":"IF(Schedule!D3=\"\",\"\",(Schedule!D3))","v":"OG"},{"$f":"IF(Schedule!E3=\"\",\"\",(Schedule!E3))","v":2}]
[null,{"$f":"IF(OR(RaceCard!$V2=0,RaceCard!$V2=\"\",RaceCard!$V2>1000),\"\",RaceCard!M2)","v":""},{"$f":"IF(B4=\"\",\"\",RaceCard!N2)","v":""},{"$f":"IF(B4=\"\",\"\",RaceCard!V2)","v":""},{"$f":"IF(B4=\"\",\"\",RaceCard!W2)","v":""},{"$f":"IF(B4=\"\",\"\",RaceCard!U2)","v":""},{"$f":"IF(OR(D4=\"\",D4=0,F4=0),\"\",(D4-F4)/F4)","v":""},{"$f":"IF(B4=\"\",\"\",RaceCard!O2)","v":""},{"$f":"IF(B4=\"\",\"\",IF($B4=RaceCard!$B$13,1,IF($B4=RaceCard!$C$13,2,IF($B4=RaceCard!$D$13,3,IF($B4=RaceCard!$E$13,4,\"\")))))","v":""},{"$f":"IF($B4=\"\",\"\",IF($B4=RaceCard!$B$14,1,IF($B4=RaceCard!$C$14,2,IF($B4=RaceCard!$D$14,3,IF($B4=RaceCard!$E$14,4,\"\")))))","v":""},{"$f":"IF(B4=\"\",\"\",RaceCard!T2)","v":""},{"$f":"IF(B4=\"\",\"\",IF($B4=RaceCard!$B$12,1,\"\"))","v":""},{"$f":"IF(B4=\"\",\"\",IF(RaceCard!S2=\"\",\"\",RaceCard!S2))","v":""},{"$f":"IF(B4=\"\",\"\",IF(RaceCard!X2=\"\",\"\",RaceCard!X2))","v":""},{"$f":"IF(C4=\"\",\"\",IF(RaceCard!Y2=\"\",\"\",RaceCard!Y2))","v":""},{"$f":"IF(D4=\"\",\"\",IF(RaceCard!Z2=\"\",\"\",RaceCard!Z2))","v":""},{"$f":"IF(B4=\"\",\"\",IF(RaceCard!Q2=\"\",\"\",RaceCard!Q2))","v":""},{"$f":"IF(B4=\"\",\"\",IF(RaceCard!P2=\"\",\"\",RaceCard!P2))","v":""},null,3,"09:35 AM-Cambridge-3 (G)",{"$f":"IF(Schedule!A4=\"\",\"\",(Schedule!A4))","v":"G"},{"$f":"IF(Schedule!B4=\"\",\"\",TEXT(Schedule!B4,\"HH:MM AM/PM\"))","v":"09:35 AM"},{"$f":"IF(Schedule!C4=\"\",\"\",(Schedule!C4))","v":"Cambridge"},{"$f":"IF(Schedule!D4=\"\",\"\",(Schedule!D4))","v":"OG"},{"$f":"IF(Schedule!E4=\"\",\"\",(Schedule!E4))","v":3}]
[null,{"$f":"IF(OR(RaceCard!$V3=0,RaceCard!$V3=\"\",RaceCard!$V3>1000),\"\",RaceCard!M3)","v":2},{"$f":"IF(B5=\"\",\"\",RaceCard!N3)","v":"GEE I GEORGE"},{"$f":"IF(B5=\"\",\"\",RaceCard!V3)","v":13.1},{"$f":"IF(B5=\"\",\"\",RaceCard!W3)","v":13.7},{"$f":"IF(B5=\"\",\"\",RaceCard!U3)","v":49.1},{"$f":"IF(OR(D5=\"\",D5=0,F5=0),\"\",(D5-F5)/F5)","v":-0.73319755600814662},{"$f":"IF(B5=\"\",\"\",RaceCard!O3)","v":59},{"$f":"IF(B5=\"\",\"\",IF($B5=RaceCard!$B$13,1,IF($B5=RaceCard!$C$13,2,IF($B5=RaceCard!$D$13,3,IF($B5=RaceCard!$E$13,4,\"\")))))","v":""},{"$f":"IF($B5=\"\",\"\",IF($B5=RaceCard!$B$14,1,IF($B5=RaceCard!$C$14,2,IF($B5=RaceCard!$D$14,3,IF($B5=RaceCard!$E$14,4,\"\")))))","v":""},{"$f":"IF(B5=\"\",\"\",RaceCard!T3)","v":78},{"$f":"IF(B5=\"\",\"\",IF($B5=RaceCard!$B$12,1,\"\"))","v":""},{"$f":"IF(B5=\"\",\"\",IF(RaceCard!S3=\"\",\"\",RaceCard!S3))","v":"0X5"},{"$f":"IF(B5=\"\",\"\",IF(RaceCard!X3=\"\",\"\",RaceCard!X3))","v":"5"},{"$f":"IF(C5=\"\",\"\",IF(RaceCard!Y3=\"\",\"\",RaceCard!Y3))","v":"X"},{"$f":"IF(D5=\"\",\"\",IF(RaceCard!Z3=\"\",\"\",RaceCard!Z3))","v":"0"},{"$f":"IF(B5=\"\",\"\",IF(RaceCard!Q3=\"\",\"\",RaceCard!Q3))","v":""},{"$f":"IF(B5=\"\",\"\",IF(RaceCard!P3=\"\",\"\",RaceCard!P3))","v":"M BROWN(A)"},null,4,"10:05 AM-Cambridge-4 (G)",{"$f":"IF(Schedule!A5=\"\",\"\",(Schedule!A5))","v":"G"},{"$f":"IF(Schedule!B5=\"\",\"\",TEXT(Schedule!B5,\"HH:MM AM/PM\"))","v":"10:05 AM"},{"$f":"IF(Schedule!C5=\"\",\"\",(Schedule!C5))","v":"Cambridge"},{"$f":"IF(Schedule!D5=\"\",\"\",(Schedule!D5))","v":"OG"},{"$f":"IF(Schedule!E5=\"\",\"\",(Schedule!E5))","v":4}]
[null,{"$f":"IF(OR(RaceCard!$V4=0,RaceCard!$V4=\"\",RaceCard!$V4>1000),\"\",RaceCard!M4)","v":3},{"$f":"IF(B6=\"\",\"\",RaceCard!N4)","v":"GOLDEN STITCH"},{"$f":"IF(B6=\"\",\"\",RaceCard!V4)","v":17.5},{"$f":"IF(B6=\"\",\"\",RaceCard!W4)","v":13.7},{"$f":"IF(B6=\"\",\"\",RaceCard!U4)","v":16.3},7.361963190184044E-2,{"$f":"IF(B6=\"\",\"\",RaceCard!O4)","v":59},{"$f":"IF(B6=\"\",\"\",IF($B6=RaceCard!$B$13,1,IF($B6=RaceCard!$C$13,2,IF($B6=RaceCard!$D$13,3,IF($B6=RaceCard!$E$13,4,\"\")))))","v":""},{"$f":"IF($B6=\"\",\"\",IF($B6=RaceCard!$B$14,1,IF($B6=RaceCard!$C$14,2,IF($B6=RaceCard!$D$14,3,IF($B6=RaceCard!$E$14,4,\"\")))))","v":""},{"$f":"IF(B6=\"\",\"\",RaceCard!T4)","v":78},{"$f":"IF(B6=\"\",\"\",IF($B6=RaceCard!$B$12,1,\"\"))","v":""},{"$f":"IF(B6=\"\",\"\",IF(RaceCard!S4=\"\",\"\",RaceCard!S4))","v":"00X"},{"$f":"IF(B6=\"\",\"\",IF(RaceCard!X4=\"\",\"\",RaceCard!X4))","v":"X"},{"$f":"IF(C6=\"\",\"\",IF(RaceCard!Y4=\"\",\"\",RaceCard!Y4))","v":"0"},{"$f":"IF(D6=\"\",\"\",IF(RaceCard!Z4=\"\",\"\",RaceCard!Z4))","v":"0"},{"$f":"IF(B6=\"\",\"\",IF(RaceCard!Q4=\"\",\"\",RaceCard!Q4))","v":""},{"$f":"IF(B6=\"\",\"\",IF(RaceCard!P4=\"\",\"\",RaceCard!P4))","v":"S THURLOW"},null,5,"10:20 AM-Cambridge-1 (T)",{"$f":"IF(Schedule!A6=\"\",\"\",(Schedule!A6))","v":"T"},{"$f":"IF(Schedule!B6=\"\",\"\",TEXT(Schedule!B6,\"HH:MM AM/PM\"))","v":"10:20 AM"},{"$f":"IF(Schedule!C6=\"\",\"\",(Schedule!C6))","v":"Cambridge"},{"$f":"IF(Schedule!D6=\"\",\"\",(Schedule!D6))","v":"ZT"},{"$f":"IF(Schedule!E6=\"\",\"\",(Schedule!E6))","v":1}]
[null,{"$f":"IF(OR(RaceCard!$V5=0,RaceCard!$V5=\"\",RaceCard!$V5>1000),\"\",RaceCard!M5)","v":4},{"$f":"IF(B7=\"\",\"\",RaceCard!N5)","v":"OUR DANCER"},{"$f":"IF(B7=\"\",\"\",RaceCard!V5)","v":14.3},{"$f":"IF(B7=\"\",\"\",RaceCard!W5)","v":5.4},{"$f":"IF(B7=\"\",\"\",RaceCard!U5)","v":8.9},0.6067415730337079,{"$f":"IF(B7=\"\",\"\",RaceCard!O5)","v":59},{"$f":"IF(B7=\"\",\"\",IF($B7=RaceCard!$B$13,1,IF($B7=RaceCard!$C$13,2,IF($B7=RaceCard!$D$13,3,IF($B7=RaceCard!$E$13,4,\"\")))))","v":""},{"$f":"IF($B7=\"\",\"\",IF($B7=RaceCard!$B$14,1,IF($B7=RaceCard!$C$14,2,IF($B7=RaceCard!$D$14,3,IF($B7=RaceCard!$E$14,4,\"\")))))","v":""},{"$f":"IF(B7=\"\",\"\",RaceCard!T5)","v":79},{"$f":"IF(B7=\"\",\"\",IF($B7=RaceCard!$B$12,1,\"\"))","v":""},{"$f":"IF(B7=\"\",\"\",IF(RaceCard!S5=\"\",\"\",RaceCard!S5))","v":"85X"},{"$f":"IF(B7=\"\",\"\",IF(RaceCard!X5=\"\",\"\",RaceCard!X5))","v":"X"},{"$f":"IF(C7=\"\",\"\",IF(RaceCard!Y5=\"\",\"\",RaceCard!Y5))","v":"5"},{"$f":"IF(D7=\"\",\"\",IF(RaceCard!Z5=\"\",\"\",RaceCard!Z5))","v":"8"},{"$f":"IF(B7=\"\",\"\",IF(RaceCard!Q5=\"\",\"\",RaceCard!Q5))","v":""},{"$f":"IF(B7=\"\",\"\",IF(RaceCard!P5=\"\",\"\",RaceCard!P5))","v":"M PAGET"},null,6,"10:35 AM-Cambridge-5 (G)",{"$f":"IF(Schedule!A7=\"\",\"\",(Schedule!A7))","v":"G"},{"$f":"IF(Schedule!B7=\"\",\"\",TEXT(Schedule!B7,\"HH:MM AM/PM\"))","v":"10:35 AM"},{"$f":"IF(Schedule!C7=\"\",\"\",(Schedule!C7))","v":"Cambridge"},{"$f":"IF(Schedule!D7=\"\",\"\",(Schedule!D7))","v":"OG"},{"$f":"IF(Schedule!E7=\"\",\"\",(Schedule!E7))","v":5}]
[null,{"$f":"IF(OR(RaceCard!$V6=0,RaceCard!$V6=\"\",RaceCard!$V6>1000),\"\",RaceCard!M6)","v":5},{"$f":"IF(B8=\"\",\"\",RaceCard!N6)","v":"SNIPPET EXPRESS"},{"$f":"IF(B8=\"\",\"\",RaceCard!V6)","v":14.3},{"$f":"IF(B8=\"\",\"\",RaceCard!W6)","v":13.7},{"$f":"IF(B8=\"\",\"\",RaceCard!U6)","v":12.2},0.17213114754098374,{"$f":"IF(B8=\"\",\"\",RaceCard!O6)","v":59},{"$f":"IF(B8=\"\",\"\",IF($B8=RaceCard!$B$13,1,IF($B8=RaceCard!$C$13,2,IF($B8=RaceCard!$D$13,3,IF($B8=RaceCard!$E$13,4,\"\")))))","v":3},{"$f":"IF($B8=\"\",\"\",IF($B8=RaceCard!$B$14,1,IF($B8=RaceCard!$C$14,2,IF($B8=RaceCard!$D$14,3,IF($B8=RaceCard!$E$14,4,\"\")))))","v":""},{"$f":"IF(B8=\"\",\"\",RaceCard!T6)","v":93},{"$f":"IF(B8=\"\",\"\",IF($B8=RaceCard!$B$12,1,\"\"))","v":""},{"$f":"IF(B8=\"\",\"\",IF(RaceCard!S6=\"\",\"\",RaceCard!S6))","v":"60X"},{"$f":"IF(B8=\"\",\"\",IF(RaceCard!X6=\"\",\"\",RaceCard!X6))","v":"X"},{"$f":"IF(C8=\"\",\"\",IF(RaceCard!Y6=\"\",\"\",RaceCard!Y6))","v":"0"},{"$f":"IF(D8=\"\",\"\",IF(RaceCard!Z6=\"\",\"\",RaceCard!Z6))","v":"6"},{"$f":"IF(B8=\"\",\"\",IF(RaceCard!Q6=\"\",\"\",RaceCard!Q6))","v":""},{"$f":"IF(B8=\"\",\"\",IF(RaceCard!P6=\"\",\"\",RaceCard!P6))","v":"M DRACOS"},null,7,"10:50 AM-Cambridge-2 (T)",{"$f":"IF(Schedule!A8=\"\",\"\",(Schedule!A8))","v":"T"},{"$f":"IF(Schedule!B8=\"\",\"\",TEXT(Schedule!B8,\"HH:MM AM/PM\"))","v":"10:50 AM"},{"$f":"IF(Schedule!C8=\"\",\"\",(Schedule!C8))","v":"Cambridge"},{"$f":"IF(Schedule!D8=\"\",\"\",(Schedule!D8))","v":"ZT"},{"$f":"IF(Schedule!E8=\"\",\"\",(Schedule!E8))","v":2}]
[null,{"$f":"IF(OR(RaceCard!$V7=0,RaceCard!$V7=\"\",RaceCard!$V7>1000),\"\",RaceCard!M7)","v":6},{"$f":"IF(B9=\"\",\"\",RaceCard!N7)","v":"TAKIRI"},{"$f":"IF(B9=\"\",\"\",RaceCard!V7)","v":31.6},{"$f":"IF(B9=\"\",\"\",RaceCard!W7)","v":6.8},{"$f":"IF(B9=\"\",\"\",RaceCard!U7)","v":19.600000000000001},0.61224489795918358,{"$f":"IF(B9=\"\",\"\",RaceCard!O7)","v":59},{"$f":"IF(B9=\"\",\"\",IF($B9=RaceCard!$B$13,1,IF($B9=RaceCard!$C$13,2,IF($B9=RaceCard!$D$13,3,IF($B9=RaceCard!$E$13,4,\"\")))))","v":""},{"$f":"IF($B9=\"\",\"\",IF($B9=RaceCard!$B$14,1,IF($B9=RaceCard!$C$14,2,IF($B9=RaceCard!$D$14,3,IF($B9=RaceCard!$E$14,4,\"\")))))","v":""},{"$f":"IF(B9=\"\",\"\",RaceCard!T7)","v":87},{"$f":"IF(B9=\"\",\"\",IF($B9=RaceCard!$B$12,1,\"\"))","v":""},{"$f":"IF(B9=\"\",\"\",IF(RaceCard!S7=\"\",\"\",RaceCard!S7))","v":67},{"$f":"IF(B9=\"\",\"\",IF(RaceCard!X7=\"\",\"\",RaceCard!X7))","v":"7"},{"$f":"IF(C9=\"\",\"\",IF(RaceCard!Y7=\"\",\"\",RaceCard!Y7))","v":"6"},{"$f":"IF(D9=\"\",\"\",IF(RaceCard!Z7=\"\",\"\",RaceCard!Z7))","v":""},{"$f":"IF(B9=\"\",\"\",IF(RaceCard!Q7=\"\",\"\",RaceCard!Q7))","v":""},{"$f":"IF(B9=\"\",\"\",IF(RaceCard!P7=\"\",\"\",RaceCard!P7))","v":"DARREN JONES"},null,8,"11:04 AM-Ballarat-1 (G)",{"$f":"IF(Schedule!A9=\"\",\"\",(Schedule!A9))","v":"G"},{"$f":"IF(Schedule!B9=\"\",\"\",TEXT(Schedule!B9,\"HH:MM AM/PM\"))","v":"11:04 AM"},{"$f":"IF(Schedule!C9=\"\",\"\",(Schedule!C9))","v":"Ballarat"},{"$f":"IF(Schedule!D9=\"\",\"\",(Schedule!D9))","v":"EG"},{"$f":"IF(Schedule!E9=\"\",\"\",(Schedule!E9))","v":1}]
[null,{"$f":"IF(OR(RaceCard!$V8=0,RaceCard!$V8=\"\",RaceCard!$V8>1000),\"\",RaceCard!M8)","v":7},{"$f":"IF(B10=\"\",\"\",RaceCard!N8)","v":"GOLD ARMANI"},{"$f":"IF(B10=\"\",\"\",RaceCard!V8)","v":6.3},{"$f":"IF(B10=\"\",\"\",RaceCard!W8)","v":1.9},{"$f":"IF(B10=\"\",\"\",RaceCard!U8)","v":3.9},0.61538461538461542,{"$f":"IF(B10=\"\",\"\",RaceCard!O8)","v":57},{"$f":"IF(B10=\"\",\"\",IF($B10=RaceCard!$B$13,1,IF($B10=RaceCard!$C$13,2,IF($B10=RaceCard!$D$13,3,IF($B10=RaceCard!$E$13,4,\"\")))))","v":""},{"$f":"IF($B10=\"\",\"\",IF($B10=RaceCard!$B$14,1,IF($B10=RaceCard!$C$14,2,IF($B10=RaceCard!$D$14,3,IF($B10=RaceCard!$E$14,4,\"\")))))","v":""},{"$f":"IF(B10=\"\",\"\",RaceCard!T8)","v":100},{"$f":"IF(B10=\"\",\"\",IF($B10=RaceCard!$B$12,1,\"\"))","v":""},{"$f":"IF(B10=\"\",\"\",IF(RaceCard!S8=\"\",\"\",RaceCard!S8))","v":50},{"$f":"IF(B10=\"\",\"\",IF(RaceCard!X8=\"\",\"\",RaceCard!X8))","v":"0"},{"$f":"IF(C10=\"\",\"\",IF(RaceCard!Y8=\"\",\"\",RaceCard!Y8))","v":"5"},{"$f":"IF(D10=\"\",\"\",IF(RaceCard!Z8=\"\",\"\",RaceCard!Z8))","v":""},{"$f":"IF(B10=\"\",\"\",IF(RaceCard!Q8=\"\",\"\",RaceCard!Q8))","v":""},{"$f":"IF(B10=\"\",\"\",IF(RaceCard!P8=\"\",\"\",RaceCard!P8))","v":"R THOMPSON"},null,9,"11:05 AM-Cambridge-6 (G)",{"$f":"IF(Schedule!A10=\"\",\"\",(Schedule!A10))","v":"G"},{"$f":"IF(Schedule!B10=\"\",\"\",TEXT(Schedule!B10,\"HH:MM AM/PM\"))","v":"11:05 AM"},{"$f":"IF(Schedule!C10=\"\",\"\",(Schedule!C10))","v":"Cambridge"},{"$f":"IF(Schedule!D10=\"\",\"\",(Schedule!D10))","v":"OG"},{"$f":"IF(Schedule!E10=\"\",\"\",(Schedule!E10))","v":6}]
[null,{"$f":"IF(OR(RaceCard!$V9=0,RaceCard!$V9=\"\",RaceCard!$V9>1000),\"\",RaceCard!M9)","v":""},{"$f":"IF(B11=\"\",\"\",RaceCard!N9)","v":""},{"$f":"IF(B11=\"\",\"\",RaceCard!V9)","v":""},{"$f":"IF(B11=\"\",\"\",RaceCard!W9)","v":""},{"$f":"IF(B11=\"\",\"\",RaceCard!U9)","v":""},"",{"$f":"IF(B11=\"\",\"\",RaceCard!O9)","v":""},{"$f":"IF(B11=\"\",\"\",IF($B11=RaceCard!$B$13,1,IF($B11=RaceCard!$C$13,2,IF($B11=RaceCard!$D$13,3,IF($B11=RaceCard!$E$13,4,\"\")))))","v":""},{"$f":"IF($B11=\"\",\"\",IF($B11=RaceCard!$B$14,1,IF($B11=RaceCard!$C$14,2,IF($B11=RaceCard!$D$14,3,IF($B11=RaceCard!$E$14,4,\"\")))))","v":""},{"$f":"IF(B11=\"\",\"\",RaceCard!T9)","v":""},{"$f":"IF(B11=\"\",\"\",IF($B11=RaceCard!$B$12,1,\"\"))","v":""},{"$f":"IF(B11=\"\",\"\",IF(RaceCard!S9=\"\",\"\",RaceCard!S9))","v":""},{"$f":"IF(B11=\"\",\"\",IF(RaceCard!X9=\"\",\"\",RaceCard!X9))","v":""},{"$f":"IF(C11=\"\",\"\",IF(RaceCard!Y9=\"\",\"\",RaceCard!Y9))","v":""},{"$f":"IF(D11=\"\",\"\",IF(RaceCard!Z9=\"\",\"\",RaceCard!Z9))","v":""},{"$f":"IF(B11=\"\",\"\",IF(RaceCard!Q9=\"\",\"\",RaceCard!Q9))","v":""},{"$f":"IF(B11=\"\",\"\",IF(RaceCard!P9=\"\",\"\",RaceCard!P9))","v":""},null,10,"11:20 AM-Cambridge-3 (T)",{"$f":"IF(Schedule!A11=\"\",\"\",(Schedule!A11))","v":"T"},{"$f":"IF(Schedule!B11=\"\",\"\",TEXT(Schedule!B11,\"HH:MM AM/PM\"))","v":"11:20 AM"},{"$f":"IF(Schedule!C11=\"\",\"\",(Schedule!C11))","v":"Cambridge"},{"$f":"IF(Schedule!D11=\"\",\"\",(Schedule!D11))","v":"ZT"},{"$f":"IF(Schedule!E11=\"\",\"\",(Schedule!E11))","v":3}]
[null,{"$f":"IF(OR(RaceCard!$V10=0,RaceCard!$V10=\"\",RaceCard!$V10>1000),\"\",RaceCard!M10)","v":9},{"$f":"IF(B12=\"\",\"\",RaceCard!N10)","v":"SILENT WINN"},{"$f":"IF(B12=\"\",\"\",RaceCard!V10)","v":26.3},{"$f":"IF(B12=\"\",\"\",RaceCard!W10)","v":5.4},{"$f":"IF(B12=\"\",\"\",RaceCard!U10)","v":98.3},-0.73245167853509663,{"$f":"IF(B12=\"\",\"\",RaceCard!O10)","v":57},{"$f":"IF(B12=\"\",\"\",IF($B12=RaceCard!$B$13,1,IF($B12=RaceCard!$C$13,2,IF($B12=RaceCard!$D$13,3,IF($B12=RaceCard!$E$13,4,\"\")))))","v":""},{"$f":"IF($B12=\"\",\"\",IF($B12=RaceCard!$B$14,1,IF($B12=RaceCard!$C$14,2,IF($B12=RaceCard!$D$14,3,IF($B12=RaceCard!$E$14,4,\"\")))))","v":""},{"$f":"IF(B12=\"\",\"\",RaceCard!T10)","v":85},{"$f":"IF(B12=\"\",\"\",IF($B12=RaceCard!$B$12,1,\"\"))","v":""},{"$f":"IF(B12=\"\",\"\",IF(RaceCard!S10=\"\",\"\",RaceCard!S10))","v":"0X4"},{"$f":"IF(B12=\"\",\"\",IF(RaceCard!X10=\"\",\"\",RaceCard!X10))","v":"4"},{"$f":"IF(C12=\"\",\"\",IF(RaceCard!Y10=\"\",\"\",RaceCard!Y10))","v":"X"},{"$f":"IF(D12=\"\",\"\",IF(RaceCard!Z10=\"\",\"\",RaceCard!Z10))","v":"0"},{"$f":"IF(B12=\"\",\"\",IF(RaceCard!Q10=\"\",\"\",RaceCard!Q10))","v":""},{"$f":"IF(B12=\"\",\"\",IF(RaceCard!P10=\"\",\"\",RaceCard!P10))","v":"S BIGG(A)"},null,11,"11:21 AM-Ballarat-2 (G)",{"$f":"IF(Schedule!A12=\"\",\"\",(Schedule!A12))","v":"G"},{"$f":"IF(Schedule!B12=\"\",\"\",TEXT(Schedule!B12,\"HH:MM AM/PM\"))","v":"11:21 AM"},{"$f":"IF(Schedule!C12=\"\",\"\",(Schedule!C12))","v":"Ballarat"},{"$f":"IF(Schedule!D12=\"\",\"\",(Schedule!D12))","v":"EG"},{"$f":"IF(Schedule!E12=\"\",\"\",(Schedule!E12))","v":2}]
[null,{"$f":"IF(OR(RaceCard!$V11=0,RaceCard!$V11=\"\",RaceCard!$V11>1000),\"\",RaceCard!M11)","v":10},{"$f":"IF(B13=\"\",\"\",RaceCard!N11)","v":"SUGARED ALMOND"},{"$f":"IF(B13=\"\",\"\",RaceCard!V11)","v":3.9},{"$f":"IF(B13=\"\",\"\",RaceCard!W11)","v":1.3},{"$f":"IF(B13=\"\",\"\",RaceCard!U11)","v":9.8000000000000007},-0.60204081632653061,{"$f":"IF(B13=\"\",\"\",RaceCard!O11)","v":57},{"$f":"IF(B13=\"\",\"\",IF($B13=RaceCard!$B$13,1,IF($B13=RaceCard!$C$13,2,IF($B13=RaceCard!$D$13,3,IF($B13=RaceCard!$E$13,4,\"\")))))","v":1},{"$f":"IF($B13=\"\",\"\",IF($B13=RaceCard!$B$14,1,IF($B13=RaceCard!$C$14,2,IF($B13=RaceCard!$D$14,3,IF($B13=RaceCard!$E$14,4,\"\")))))","v":""},{"$f":"IF(B13=\"\",\"\",RaceCard!T11)","v":98},{"$f":"IF(B13=\"\",\"\",IF($B13=RaceCard!$B$12,1,\"\"))","v":""},{"$f":"IF(B13=\"\",\"\",IF(RaceCard!S11=\"\",\"\",RaceCard!S11))","v":"X73"},{"$f":"IF(B13=\"\",\"\",IF(RaceCard!X11=\"\",\"\",RaceCard!X11))","v":"3"},{"$f":"IF(C13=\"\",\"\",IF(RaceCard!Y11=\"\",\"\",RaceCard!Y11))","v":"7"},{"$f":"IF(D13=\"\",\"\",IF(RaceCard!Z11=\"\",\"\",RaceCard!Z11))","v":"X"},{"$f":"IF(B13=\"\",\"\",IF(RaceCard!Q11=\"\",\"\",RaceCard!Q11))","v":""},{"$f":"IF(B13=\"\",\"\",IF(RaceCard!P11=\"\",\"\",RaceCard!P11))","v":"SHANE ARNOLD(A)"},null,12,"11:35 AM-Cambridge-7 (G)",{"$f":"IF(Schedule!A13=\"\",\"\",(Schedule!A13))","v":"G"},{"$f":"IF(Schedule!B13=\"\",\"\",TEXT(Schedule!B13,\"HH:MM AM/PM\"))","v":"11:35 AM"},{"$f":"IF(Schedule!C13=\"\",\"\",(Schedule!C13))","v":"Cambridge"},{"$f":"IF(Schedule!D13=\"\",\"\",(Schedule!D13))","v":"OG"},{"$f":"IF(Schedule!E13=\"\",\"\",(Schedule!E13))","v":7}]
[null,{"$f":"IF(OR(RaceCard!$V12=0,RaceCard!$V12=\"\",RaceCard!$V12>1000),\"\",RaceCard!M12)","v":11},{"$f":"IF(B14=\"\",\"\",RaceCard!N12)","v":"THE LIONS SHARE"},{"$f":"IF(B14=\"\",\"\",RaceCard!V12)","v":8.3000000000000007},{"$f":"IF(B14=\"\",\"\",RaceCard!W12)","v":1.5},{"$f":"IF(B14=\"\",\"\",RaceCard!U12)","v":8.1},2.4691358024691492E-2,{"$f":"IF(B14=\"\",\"\",RaceCard!O12)","v":57},{"$f":"IF(B14=\"\",\"\",IF($B14=RaceCard!$B$13,1,IF($B14=RaceCard!$C$13,2,IF($B14=RaceCard!$D$13,3,IF($B14=RaceCard!$E$13,4,\"\")))))","v":2},{"$f":"IF($B14=\"\",\"\",IF($B14=RaceCard!$B$14,1,IF($B14=RaceCard!$C$14,2,IF($B14=RaceCard!$D$14,3,IF($B14=RaceCard!$E$14,4,\"\")))))","v":""},{"$f":"IF(B14=\"\",\"\",RaceCard!T12)","v":84},{"$f":"IF(B14=\"\",\"\",IF($B14=RaceCard!$B$12,1,\"\"))","v":""},{"$f":"IF(B14=\"\",\"\",IF(RaceCard!S12=\"\",\"\",RaceCard!S12))","v":"32X"},{"$f":"IF(B14=\"\",\"\",IF(RaceCard!X12=\"\",\"\",RaceCard!X12))","v":"X"},{"$f":"IF(C14=\"\",\"\",IF(RaceCard!Y12=\"\",\"\",RaceCard!Y12))","v":"2"},{"$f":"IF(D14=\"\",\"\",IF(RaceCard!Z12=\"\",\"\",RaceCard!Z12))","v":"3"},{"$f":"IF(B14=\"\",\"\",IF(RaceCard!Q12=\"\",\"\",RaceCard!Q12))","v":""},{"$f":"IF(B14=\"\",\"\",IF(RaceCard!P12=\"\",\"\",RaceCard!P12))","v":"PATRICK LO(A)"},null,13,"11:38 AM-Ballarat-3 (G)",{"$f":"IF(Schedule!A14=\"\",\"\",(Schedule!A14))","v":"G"},{"$f":"IF(Schedule!B14=\"\",\"\",TEXT(Schedule!B14,\"HH:MM AM/PM\"))","v":"11:38 AM"},{"$f":"IF(Schedule!C14=\"\",\"\",(Schedule!C14))","v":"Ballarat"},{"$f":"IF(Schedule!D14=\"\",\"\",(Schedule!D14))","v":"EG"},{"$f":"IF(Schedule!E14=\"\",\"\",(Schedule!E14))","v":3}]
[null,{"$f":"IF(OR(RaceCard!$V13=0,RaceCard!$V13=\"\",RaceCard!$V13>1000),\"\",RaceCard!M13)","v":12},{"$f":"IF(B15=\"\",\"\",RaceCard!N13)","v":"TRIDANESCAY"},{"$f":"IF(B15=\"\",\"\",RaceCard!V13)","v":52.7},{"$f":"IF(B15=\"\",\"\",RaceCard!W13)","v":6.8},{"$f":"IF(B15=\"\",\"\",RaceCard!U13)","v":49.1},7.331975560081469E-2,{"$f":"IF(B15=\"\",\"\",RaceCard!O13)","v":57},{"$f":"IF(B15=\"\",\"\",IF($B15=RaceCard!$B$13,1,IF($B15=RaceCard!$C$13,2,IF($B15=RaceCard!$D$13,3,IF($B15=RaceCard!$E$13,4,\"\")))))","v":""},{"$f":"IF($B15=\"\",\"\",IF($B15=RaceCard!$B$14,1,IF($B15=RaceCard!$C$14,2,IF($B15=RaceCard!$D$14,3,IF($B15=RaceCard!$E$14,4,\"\")))))","v":""},{"$f":"IF(B15=\"\",\"\",RaceCard!T13)","v":78},{"$f":"IF(B15=\"\",\"\",IF($B15=RaceCard!$B$12,1,\"\"))","v":""},{"$f":"IF(B15=\"\",\"\",IF(RaceCard!S13=\"\",\"\",RaceCard!S13))","v":"0X9"},{"$f":"IF(B15=\"\",\"\",IF(RaceCard!X13=\"\",\"\",RaceCard!X13))","v":"9"},{"$f":"IF(C15=\"\",\"\",IF(RaceCard!Y13=\"\",\"\",RaceCard!Y13))","v":"X"},{"$f":"IF(D15=\"\",\"\",IF(RaceCard!Z13=\"\",\"\",RaceCard!Z13))","v":"0"},{"$f":"IF(B15=\"\",\"\",IF(RaceCard!Q13=\"\",\"\",RaceCard!Q13))","v":""},{"$f":"IF(B15=\"\",\"\",IF(RaceCard!P13=\"\",\"\",RaceCard!P13))","v":"M POWELL(A)"},null,14,"11:50 AM-Cambridge-4 (T)",{"$f":"IF(Schedule!A15=\"\",\"\",(Schedule!A15))","v":"T"},{"$f":"IF(Schedule!B15=\"\",\"\",TEXT(Schedule!B15,\"HH:MM AM/PM\"))","v":"11:50 AM"},{"$f":"IF(Schedule!C15=\"\",\"\",(Schedule!C15))","v":"Cambridge"},{"$f":"IF(Schedule!D15=\"\",\"\",(Schedule!D15))","v":"ZT"},{"$f":"IF(Schedule!E15=\"\",\"\",(Schedule!E15))","v":4}]
[null,{"$f":"IF(OR(RaceCard!$V14=0,RaceCard!$V14=\"\",RaceCard!$V14>1000),\"\",RaceCard!M14)","v":13},{"$f":"IF(B16=\"\",\"\",RaceCard!N14)","v":"VESTALIA"},{"$f":"IF(B16=\"\",\"\",RaceCard!V14)","v":4.5999999999999996},{"$f":"IF(B16=\"\",\"\",RaceCard!W14)","v":1.6},{"$f":"IF(B16=\"\",\"\",RaceCard!U14)","v":3.1},0.48387096774193533,{"$f":"IF(B16=\"\",\"\",RaceCard!O14)","v":57},{"$f":"IF(B16=\"\",\"\",IF($B16=RaceCard!$B$13,1,IF($B16=RaceCard!$C$13,2,IF($B16=RaceCard!$D$13,3,IF($B16=RaceCard!$E$13,4,\"\")))))","v":""},{"$f":"IF($B16=\"\",\"\",IF($B16=RaceCard!$B$14,1,IF($B16=RaceCard!$C$14,2,IF($B16=RaceCard!$D$14,3,IF($B16=RaceCard!$E$14,4,\"\")))))","v":""},{"$f":"IF(B16=\"\",\"\",RaceCard!T14)","v":93},{"$f":"IF(B16=\"\",\"\",IF($B16=RaceCard!$B$12,1,\"\"))","v":""},{"$f":"IF(B16=\"\",\"\",IF(RaceCard!S14=\"\",\"\",RaceCard!S14))","v":"3X3"},{"$f":"IF(B16=\"\",\"\",IF(RaceCard!X14=\"\",\"\",RaceCard!X14))","v":"3"},{"$f":"IF(C16=\"\",\"\",IF(RaceCard!Y14=\"\",\"\",RaceCard!Y14))","v":"X"},{"$f":"IF(D16=\"\",\"\",IF(RaceCard!Z14=\"\",\"\",RaceCard!Z14))","v":"3"},{"$f":"IF(B16=\"\",\"\",IF(RaceCard!Q14=\"\",\"\",RaceCard!Q14))","v":""},{"$f":"IF(B16=\"\",\"\",IF(RaceCard!P14=\"\",\"\",RaceCard!P14))","v":"L G HENRY"},null,15,"11:55 AM-Ballarat-4 (G)",{"$f":"IF(Schedule!A16=\"\",\"\",(Schedule!A16))","v":"G"},{"$f":"IF(Schedule!B16=\"\",\"\",TEXT(Schedule!B16,\"HH:MM AM/PM\"))","v":"11:55 AM"},{"$f":"IF(Schedule!C16=\"\",\"\",(Schedule!C16))","v":"Ballarat"},{"$f":"IF(Schedule!D16=\"\",\"\",(Schedule!D16))","v":"EG"},{"$f":"IF(Schedule!E16=\"\",\"\",(Schedule!E16))","v":4}]
[null,{"$f":"IF(OR(RaceCard!$V15=0,RaceCard!$V15=\"\",RaceCard!$V15>1000),\"\",RaceCard!M15)","v":14},{"$f":"IF(B17=\"\",\"\",RaceCard!N15)","v":"WITCHY WOMEN"},{"$f":"IF(B17=\"\",\"\",RaceCard!V15)","v":15.8},{"$f":"IF(B17=\"\",\"\",RaceCard!W15)","v":9.1},{"$f":"IF(B17=\"\",\"\",RaceCard!U15)","v":49.1},-0.67820773930753553,{"$f":"IF(B17=\"\",\"\",RaceCard!O15)","v":57},{"$f":"IF(B17=\"\",\"\",IF($B17=RaceCard!$B$13,1,IF($B17=RaceCard!$C$13,2,IF($B17=RaceCard!$D$13,3,IF($B17=RaceCard!$E$13,4,\"\")))))","v":""},{"$f":"IF($B17=\"\",\"\",IF($B17=RaceCard!$B$14,1,IF($B17=RaceCard!$C$14,2,IF($B17=RaceCard!$D$14,3,IF($B17=RaceCard!$E$14,4,\"\")))))","v":""},{"$f":"IF(B17=\"\",\"\",RaceCard!T15)","v":83},{"$f":"IF(B17=\"\",\"\",IF($B17=RaceCard!$B$12,1,\"\"))","v":""},{"$f":"IF(B17=\"\",\"\",IF(RaceCard!S15=\"\",\"\",RaceCard!S15))","v":"7X"},{"$f":"IF(B17=\"\",\"\",IF(RaceCard!X15=\"\",\"\",RaceCard!X15))","v":"X"},{"$f":"IF(C17=\"\",\"\",IF(RaceCard!Y15=\"\",\"\",RaceCard!Y15))","v":"7"},{"$f":"IF(D17=\"\",\"\",IF(RaceCard!Z15=\"\",\"\",RaceCard!Z15))","v":""},{"$f":"IF(B17=\"\",\"\",IF(RaceCard!Q15=\"\",\"\",RaceCard!Q15))","v":""},{"$f":"IF(B17=\"\",\"\",IF(RaceCard!P15=\"\",\"\",RaceCard!P15))","v":"B LOOKER"},null,16,"12:00 PM-Sale-1 (R)",{"$f":"IF(Schedule!A17=\"\",\"\",(Schedule!A17))","v":"R"},{"$f":"IF(Schedule!B17=\"\",\"\",TEXT(Schedule!B17,\"HH:MM AM/PM\"))","v":"12:00 PM"},{"$f":"IF(Schedule!C17=\"\",\"\",(Schedule!C17))","v":"Sale"},{"$f":"IF(Schedule!D17=\"\",\"\",(Schedule!D17))","v":"VR"},{"$f":"IF(Schedule!E17=\"\",\"\",(Schedule!E17))","v":1}]
[null,{"$f":"IF(OR(RaceCard!$V16=0,RaceCard!$V16=\"\",RaceCard!$V16>1000),\"\",RaceCard!M16)","v":""},{"$f":"IF(B18=\"\",\"\",RaceCard!N16)","v":""},{"$f":"IF(B18=\"\",\"\",RaceCard!V16)","v":""},{"$f":"IF(B18=\"\",\"\",RaceCard!W16)","v":""},{"$f":"IF(B18=\"\",\"\",RaceCard!U16)","v":""},"",{"$f":"IF(B18=\"\",\"\",RaceCard!O16)","v":""},{"$f":"IF(B18=\"\",\"\",IF($B18=RaceCard!$B$13,1,IF($B18=RaceCard!$C$13,2,IF($B18=RaceCard!$D$13,3,IF($B18=RaceCard!$E$13,4,\"\")))))","v":""},{"$f":"IF($B18=\"\",\"\",IF($B18=RaceCard!$B$14,1,IF($B18=RaceCard!$C$14,2,IF($B18=RaceCard!$D$14,3,IF($B18=RaceCard!$E$14,4,\"\")))))","v":""},{"$f":"IF(B18=\"\",\"\",RaceCard!T16)","v":""},{"$f":"IF(B18=\"\",\"\",IF($B18=RaceCard!$B$12,1,\"\"))","v":""},{"$f":"IF(B18=\"\",\"\",IF(RaceCard!S16=\"\",\"\",RaceCard!S16))","v":""},{"$f":"IF(B18=\"\",\"\",IF(RaceCard!X16=\"\",\"\",RaceCard!X16))","v":""},{"$f":"IF(C18=\"\",\"\",IF(RaceCard!Y16=\"\",\"\",RaceCard!Y16))","v":""},{"$f":"IF(D18=\"\",\"\",IF(RaceCard!Z16=\"\",\"\",RaceCard!Z16))","v":""},{"$f":"IF(B18=\"\",\"\",IF(RaceCard!Q16=\"\",\"\",RaceCard!Q16))","v":""},{"$f":"IF(B18=\"\",\"\",IF(RaceCard!P16=\"\",\"\",RaceCard!P16))","v":""},null,17,"12:04 PM-Goulburn-1 (T)",{"$f":"IF(Schedule!A18=\"\",\"\",(Schedule!A18))","v":"T"},{"$f":"IF(Schedule!B18=\"\",\"\",TEXT(Schedule!B18,\"HH:MM AM/PM\"))","v":"12:04 PM"},{"$f":"IF(Schedule!C18=\"\",\"\",(Schedule!C18))","v":"Goulburn"},{"$f":"IF(Schedule!D18=\"\",\"\",(Schedule!D18))","v":"NT"},{"$f":"IF(Schedule!E18=\"\",\"\",(Schedule!E18))","v":1}]
[null,{"$f":"IF(OR(RaceCard!$V17=0,RaceCard!$V17=\"\",RaceCard!$V17>1000),\"\",RaceCard!M17)","v":""},{"$f":"IF(B19=\"\",\"\",RaceCard!N17)","v":""},{"$f":"IF(B19=\"\",\"\",RaceCard!V17)","v":""},{"$f":"IF(B19=\"\",\"\",RaceCard!W17)","v":""},{"$f":"IF(B19=\"\",\"\",RaceCard!U17)","v":""},"",{"$f":"IF(B19=\"\",\"\",RaceCard!O17)","v":""},{"$f":"IF(B19=\"\",\"\",IF($B19=RaceCard!$B$13,1,IF($B19=RaceCard!$C$13,2,IF($B19=RaceCard!$D$13,3,IF($B19=RaceCard!$E$13,4,\"\")))))","v":""},{"$f":"IF($B19=\"\",\"\",IF($B19=RaceCard!$B$14,1,IF($B19=RaceCard!$C$14,2,IF($B19=RaceCard!$D$14,3,IF($B19=RaceCard!$E$14,4,\"\")))))","v":""},{"$f":"IF(B19=\"\",\"\",RaceCard!T17)","v":""},{"$f":"IF(B19=\"\",\"\",IF($B19=RaceCard!$B$12,1,\"\"))","v":""},{"$f":"IF(B19=\"\",\"\",IF(RaceCard!S17=\"\",\"\",RaceCard!S17))","v":""},{"$f":"IF(B19=\"\",\"\",IF(RaceCard!X17=\"\",\"\",RaceCard!X17))","v":""},{"$f":"IF(C19=\"\",\"\",IF(RaceCard!Y17=\"\",\"\",RaceCard!Y17))","v":""},{"$f":"IF(D19=\"\",\"\",IF(RaceCard!Z17=\"\",\"\",RaceCard!Z17))","v":""},{"$f":"IF(B19=\"\",\"\",IF(RaceCard!Q17=\"\",\"\",RaceCard!Q17))","v":""},{"$f":"IF(B19=\"\",\"\",IF(RaceCard!P17=\"\",\"\",RaceCard!P17))","v":""},null,18,"12:05 PM-Cambridge-8 (G)",{"$f":"IF(Schedule!A19=\"\",\"\",(Schedule!A19))","v":"G"},{"$f":"IF(Schedule!B19=\"\",\"\",TEXT(Schedule!B19,\"HH:MM AM/PM\"))","v":"12:05 PM"},{"$f":"IF(Schedule!C19=\"\",\"\",(Schedule!C19))","v":"Cambridge"},{"$f":"IF(Schedule!D19=\"\",\"\",(Schedule!D19))","v":"OG"},{"$f":"IF(Schedule!E19=\"\",\"\",(Schedule!E19))","v":8}]
[null,{"$f":"IF(OR(RaceCard!$V18=0,RaceCard!$V18=\"\",RaceCard!$V18>1000),\"\",RaceCard!M18)","v":""},{"$f":"IF(B20=\"\",\"\",RaceCard!N18)","v":""},{"$f":"IF(B20=\"\",\"\",RaceCard!V18)","v":""},{"$f":"IF(B20=\"\",\"\",RaceCard!W18)","v":""},{"$f":"IF(B20=\"\",\"\",RaceCard!U18)","v":""},"",{"$f":"IF(B20=\"\",\"\",RaceCard!O18)","v":""},{"$f":"IF(B20=\"\",\"\",IF($B20=RaceCard!$B$13,1,IF($B20=RaceCard!$C$13,2,IF($B20=RaceCard!$D$13,3,IF($B20=RaceCard!$E$13,4,\"\")))))","v":""},{"$f":"IF($B20=\"\",\"\",IF($B20=RaceCard!$B$14,1,IF($B20=RaceCard!$C$14,2,IF($B20=RaceCard!$D$14,3,IF($B20=RaceCard!$E$14,4,\"\")))))","v":""},{"$f":"IF(B20=\"\",\"\",RaceCard!T18)","v":""},{"$f":"IF(B20=\"\",\"\",IF($B20=RaceCard!$B$12,1,\"\"))","v":""},{"$f":"IF(B20=\"\",\"\",IF(RaceCard!S18=\"\",\"\",RaceCard!S18))","v":""},{"$f":"IF(B20=\"\",\"\",IF(RaceCard!X18=\"\",\"\",RaceCard!X18))","v":""},{"$f":"IF(C20=\"\",\"\",IF(RaceCard!Y18=\"\",\"\",RaceCard!Y18))","v":""},{"$f":"IF(D20=\"\",\"\",IF(RaceCard!Z18=\"\",\"\",RaceCard!Z18))","v":""},{"$f":"IF(B20=\"\",\"\",IF(RaceCard!Q18=\"\",\"\",RaceCard!Q18))","v":""},{"$f":"IF(B20=\"\",\"\",IF(RaceCard!P18=\"\",\"\",RaceCard!P18))","v":""},null,19,"12:10 PM-Orange-1 (R)",{"$f":"IF(Schedule!A20=\"\",\"\",(Schedule!A20))","v":"R"},{"$f":"IF(Schedule!B20=\"\",\"\",TEXT(Schedule!B20,\"HH:MM AM/PM\"))","v":"12:10 PM"},{"$f":"IF(Schedule!C20=\"\",\"\",(Schedule!C20))","v":"Orange"},{"$f":"IF(Schedule!D20=\"\",\"\",(Schedule!D20))","v":"CR"},{"$f":"IF(Schedule!E20=\"\",\"\",(Schedule!E20))","v":1}]
[null,{"$f":"IF(OR(RaceCard!$V19=0,RaceCard!$V19=\"\",RaceCard!$V19>1000),\"\",RaceCard!M19)","v":""},{"$f":"IF(B21=\"\",\"\",RaceCard!N19)","v":""},{"$f":"IF(B21=\"\",\"\",RaceCard!V19)","v":""},{"$f":"IF(B21=\"\",\"\",RaceCard!W19)","v":""},{"$f":"IF(B21=\"\",\"\",RaceCard!U19)","v":""},"",{"$f":"IF(B21=\"\",\"\",RaceCard!O19)","v":""},{"$f":"IF(B21=\"\",\"\",IF($B21=RaceCard!$B$13,1,IF($B21=RaceCard!$C$13,2,IF($B21=RaceCard!$D$13,3,IF($B21=RaceCard!$E$13,4,\"\")))))","v":""},{"$f":"IF($B21=\"\",\"\",IF($B21=RaceCard!$B$14,1,IF($B21=RaceCard!$C$14,2,IF($B21=RaceCard!$D$14,3,IF($B21=RaceCard!$E$14,4,\"\")))))","v":""},{"$f":"IF(B21=\"\",\"\",RaceCard!T19)","v":""},{"$f":"IF(B21=\"\",\"\",IF($B21=RaceCard!$B$12,1,\"\"))","v":""},{"$f":"IF(B21=\"\",\"\",IF(RaceCard!S19=\"\",\"\",RaceCard!S19))","v":""},{"$f":"IF(B21=\"\",\"\",IF(RaceCard!X19=\"\",\"\",RaceCard!X19))","v":""},{"$f":"IF(C21=\"\",\"\",IF(RaceCard!Y19=\"\",\"\",RaceCard!Y19))","v":""},{"$f":"IF(D21=\"\",\"\",IF(RaceCard!Z19=\"\",\"\",RaceCard!Z19))","v":""},{"$f":"IF(B21=\"\",\"\",IF(RaceCard!Q19=\"\",\"\",RaceCard!Q19))","v":""},{"$f":"IF(B21=\"\",\"\",IF(RaceCard!P19=\"\",\"\",RaceCard!P19))","v":""},null,20,"12:14 PM-Ballarat-5 (G)",{"$f":"IF(Schedule!A21=\"\",\"\",(Schedule!A21))","v":"G"},{"$f":"IF(Schedule!B21=\"\",\"\",TEXT(Schedule!B21,\"HH:MM AM/PM\"))","v":"12:14 PM"},{"$f":"IF(Schedule!C21=\"\",\"\",(Schedule!C21))","v":"Ballarat"},{"$f":"IF(Schedule!D21=\"\",\"\",(Schedule!D21))","v":"EG"},{"$f":"IF(Schedule!E21=\"\",\"\",(Schedule!E21))","v":5}]
[null,{"$f":"IF(OR(RaceCard!$V20=0,RaceCard!$V20=\"\",RaceCard!$V20>1000),\"\",RaceCard!M20)","v":""},{"$f":"IF(B22=\"\",\"\",RaceCard!N20)","v":""},{"$f":"IF(B22=\"\",\"\",RaceCard!V20)","v":""},{"$f":"IF(B22=\"\",\"\",RaceCard!W20)","v":""},{"$f":"IF(B22=\"\",\"\",RaceCard!U20)","v":""},"",{"$f":"IF(B22=\"\",\"\",RaceCard!O20)","v":""},{"$f":"IF(B22=\"\",\"\",IF($B22=RaceCard!$B$13,1,IF($B22=RaceCard!$C$13,2,IF($B22=RaceCard!$D$13,3,IF($B22=RaceCard!$E$13,4,\"\")))))","v":""},{"$f":"IF($B22=\"\",\"\",IF($B22=RaceCard!$B$14,1,IF($B22=RaceCard!$C$14,2,IF($B22=RaceCard!$D$14,3,IF($B22=RaceCard!$E$14,4,\"\")))))","v":""},{"$f":"IF(B22=\"\",\"\",RaceCard!T20)","v":""},{"$f":"IF(B22=\"\",\"\",IF($B22=RaceCard!$B$12,1,\"\"))","v":""},{"$f":"IF(B22=\"\",\"\",IF(RaceCard!S20=\"\",\"\",RaceCard!S20))","v":""},{"$f":"IF(B22=\"\",\"\",IF(RaceCard!X20=\"\",\"\",RaceCard!X20))","v":""},{"$f":"IF(C22=\"\",\"\",IF(RaceCard!Y20=\"\",\"\",RaceCard!Y20))","v":""},{"$f":"IF(D22=\"\",\"\",IF(RaceCard!Z20=\"\",\"\",RaceCard!Z20))","v":""},{"$f":"IF(B22=\"\",\"\",IF(RaceCard!Q20=\"\",\"\",RaceCard!Q20))","v":""},{"$f":"IF(B22=\"\",\"\",IF(RaceCard!P20=\"\",\"\",RaceCard!P20))","v":""},null,21,"12:17 PM-Maryborough-1 (T)",{"$f":"IF(Schedule!A22=\"\",\"\",(Schedule!A22))","v":"T"},{"$f":"IF(Schedule!B22=\"\",\"\",TEXT(Schedule!B22,\"HH:MM AM/PM\"))","v":"12:17 PM"},{"$f":"IF(Schedule!C22=\"\",\"\",(Schedule!C22))","v":"Maryborough"},{"$f":"IF(Schedule!D22=\"\",\"\",(Schedule!D22))","v":"VT"},{"$f":"IF(Schedule!E22=\"\",\"\",(Schedule!E22))","v":1}]
[null,{"$f":"IF(OR(RaceCard!$V21=0,RaceCard!$V21=\"\",RaceCard!$V21>1000),\"\",RaceCard!M21)","v":""},{"$f":"IF(B23=\"\",\"\",RaceCard!N21)","v":""},{"$f":"IF(B23=\"\",\"\",RaceCard!V21)","v":""},{"$f":"IF(B23=\"\",\"\",RaceCard!W21)","v":""},{"$f":"IF(B23=\"\",\"\",RaceCard!U21)","v":""},"",{"$f":"IF(B23=\"\",\"\",RaceCard!O21)","v":""},{"$f":"IF(B23=\"\",\"\",IF($B23=RaceCard!$B$13,1,IF($B23=RaceCard!$C$13,2,IF($B23=RaceCard!$D$13,3,IF($B23=RaceCard!$E$13,4,\"\")))))","v":""},{"$f":"IF($B23=\"\",\"\",IF($B23=RaceCard!$B$14,1,IF($B23=RaceCard!$C$14,2,IF($B23=RaceCard!$D$14,3,IF($B23=RaceCard!$E$14,4,\"\")))))","v":""},{"$f":"IF(B23=\"\",\"\",RaceCard!T21)","v":""},{"$f":"IF(B23=\"\",\"\",IF($B23=RaceCard!$B$12,1,\"\"))","v":""},{"$f":"IF(B23=\"\",\"\",IF(RaceCard!S21=\"\",\"\",RaceCard!S21))","v":""},{"$f":"IF(B23=\"\",\"\",IF(RaceCard!X21=\"\",\"\",RaceCard!X21))","v":""},{"$f":"IF(C23=\"\",\"\",IF(RaceCard!Y21=\"\",\"\",RaceCard!Y21))","v":""},{"$f":"IF(D23=\"\",\"\",IF(RaceCard!Z21=\"\",\"\",RaceCard!Z21))","v":""},{"$f":"IF(B23=\"\",\"\",IF(RaceCard!Q21=\"\",\"\",RaceCard!Q21))","v":""},{"$f":"IF(B23=\"\",\"\",IF(RaceCard!P21=\"\",\"\",RaceCard!P21))","v":""},null,22,"12:20 PM-Cambridge-5 (T)",{"$f":"IF(Schedule!A23=\"\",\"\",(Schedule!A23))","v":"T"},{"$f":"IF(Schedule!B23=\"\",\"\",TEXT(Schedule!B23,\"HH:MM AM/PM\"))","v":"12:20 PM"},{"$f":"IF(Schedule!C23=\"\",\"\",(Schedule!C23))","v":"Cambridge"},{"$f":"IF(Schedule!D23=\"\",\"\",(Schedule!D23))","v":"ZT"},{"$f":"IF(Schedule!E23=\"\",\"\",(Schedule!E23))","v":5}]
[null,{"$f":"IF(OR(RaceCard!$V22=0,RaceCard!$V22=\"\",RaceCard!$V22>1000),\"\",RaceCard!M22)","v":""},{"$f":"IF(B24=\"\",\"\",RaceCard!N22)","v":""},{"$f":"IF(B24=\"\",\"\",RaceCard!V22)","v":""},{"$f":"IF(B24=\"\",\"\",RaceCard!W22)","v":""},{"$f":"IF(B24=\"\",\"\",RaceCard!U22)","v":""},"",{"$f":"IF(B24=\"\",\"\",RaceCard!O22)","v":""},{"$f":"IF(B24=\"\",\"\",IF($B24=RaceCard!$B$13,1,IF($B24=RaceCard!$C$13,2,IF($B24=RaceCard!$D$13,3,IF($B24=RaceCard!$E$13,4,\"\")))))","v":""},{"$f":"IF($B24=\"\",\"\",IF($B24=RaceCard!$B$14,1,IF($B24=RaceCard!$C$14,2,IF($B24=RaceCard!$D$14,3,IF($B24=RaceCard!$E$14,4,\"\")))))","v":""},{"$f":"IF(B24=\"\",\"\",RaceCard!T22)","v":""},{"$f":"IF(B24=\"\",\"\",IF($B24=RaceCard!$B$12,1,\"\"))","v":""},{"$f":"IF(B24=\"\",\"\",IF(RaceCard!S22=\"\",\"\",RaceCard!S22))","v":""},{"$f":"IF(B24=\"\",\"\",IF(RaceCard!X22=\"\",\"\",RaceCard!X22))","v":""},{"$f":"IF(C24=\"\",\"\",IF(RaceCard!Y22=\"\",\"\",RaceCard!Y22))","v":""},{"$f":"IF(D24=\"\",\"\",IF(RaceCard!Z22=\"\",\"\",RaceCard!Z22))","v":""},{"$f":"IF(B24=\"\",\"\",IF(RaceCard!Q22=\"\",\"\",RaceCard!Q22))","v":""},{"$f":"IF(B24=\"\",\"\",IF(RaceCard!P22=\"\",\"\",RaceCard!P22))","v":""},null,23,"12:23 PM-Tamworth-1 (R)",{"$f":"IF(Schedule!A24=\"\",\"\",(Schedule!A24))","v":"R"},{"$f":"IF(Schedule!B24=\"\",\"\",TEXT(Schedule!B24,\"HH:MM AM/PM\"))","v":"12:23 PM"},{"$f":"IF(Schedule!C24=\"\",\"\",(Schedule!C24))","v":"Tamworth"},{"$f":"IF(Schedule!D24=\"\",\"\",(Schedule!D24))","v":"NR"},{"$f":"IF(Schedule!E24=\"\",\"\",(Schedule!E24))","v":1}]
[null,{"$f":"IF(OR(RaceCard!$V23=0,RaceCard!$V23=\"\",RaceCard!$V23>1000),\"\",RaceCard!M23)","v":""},{"$f":"IF(B25=\"\",\"\",RaceCard!N23)","v":""},{"$f":"IF(B25=\"\",\"\",RaceCard!V23)","v":""},{"$f":"IF(B25=\"\",\"\",RaceCard!W23)","v":""},{"$f":"IF(B25=\"\",\"\",RaceCard!U23)","v":""},"",{"$f":"IF(B25=\"\",\"\",RaceCard!O23)","v":""},{"$f":"IF(B25=\"\",\"\",IF($B25=RaceCard!$B$13,1,IF($B25=RaceCard!$C$13,2,IF($B25=RaceCard!$D$13,3,IF($B25=RaceCard!$E$13,4,\"\")))))","v":""},{"$f":"IF($B25=\"\",\"\",IF($B25=RaceCard!$B$14,1,IF($B25=RaceCard!$C$14,2,IF($B25=RaceCard!$D$14,3,IF($B25=RaceCard!$E$14,4,\"\")))))","v":""},{"$f":"IF(B25=\"\",\"\",RaceCard!T23)","v":""},{"$f":"IF(B25=\"\",\"\",IF($B25=RaceCard!$B$12,1,\"\"))","v":""},{"$f":"IF(B25=\"\",\"\",IF(RaceCard!S23=\"\",\"\",RaceCard!S23))","v":""},{"$f":"IF(B25=\"\",\"\",IF(RaceCard!X23=\"\",\"\",RaceCard!X23))","v":""},{"$f":"IF(C25=\"\",\"\",IF(RaceCard!Y23=\"\",\"\",RaceCard!Y23))","v":""},{"$f":"IF(D25=\"\",\"\",IF(RaceCard!Z23=\"\",\"\",RaceCard!Z23))","v":""},{"$f":"IF(B25=\"\",\"\",IF(RaceCard!Q23=\"\",\"\",RaceCard!Q23))","v":""},{"$f":"IF(B25=\"\",\"\",IF(RaceCard!P23=\"\",\"\",RaceCard!P23))","v":""},null,24,"12:33 PM-Ballarat-6 (G)",{"$f":"IF(Schedule!A25=\"\",\"\",(Schedule!A25))","v":"G"},{"$f":"IF(Schedule!B25=\"\",\"\",TEXT(Schedule!B25,\"HH:MM AM/PM\"))","v":"12:33 PM"},{"$f":"IF(Schedule!C25=\"\",\"\",(Schedule!C25))","v":"Ballarat"},{"$f":"IF(Schedule!D25=\"\",\"\",(Schedule!D25))","v":"EG"},{"$f":"IF(Schedule!E25=\"\",\"\",(Schedule!E25))","v":6}]
[null,{"$f":"IF(OR(RaceCard!$V24=0,RaceCard!$V24=\"\",RaceCard!$V24>1000),\"\",RaceCard!M24)","v":""},{"$f":"IF(B26=\"\",\"\",RaceCard!N24)","v":""},{"$f":"IF(B26=\"\",\"\",RaceCard!V24)","v":""},{"$f":"IF(B26=\"\",\"\",RaceCard!W24)","v":""},{"$f":"IF(B26=\"\",\"\",RaceCard!U24)","v":""},"",{"$f":"IF(B26=\"\",\"\",RaceCard!O24)","v":""},{"$f":"IF(B26=\"\",\"\",IF($B26=RaceCard!$B$13,1,IF($B26=RaceCard!$C$13,2,IF($B26=RaceCard!$D$13,3,IF($B26=RaceCard!$E$13,4,\"\")))))","v":""},{"$f":"IF($B26=\"\",\"\",IF($B26=RaceCard!$B$14,1,IF($B26=RaceCard!$C$14,2,IF($B26=RaceCard!$D$14,3,IF($B26=RaceCard!$E$14,4,\"\")))))","v":""},{"$f":"IF(B26=\"\",\"\",RaceCard!T24)","v":""},{"$f":"IF(B26=\"\",\"\",IF($B26=RaceCard!$B$12,1,\"\"))","v":""},{"$f":"IF(B26=\"\",\"\",IF(RaceCard!S24=\"\",\"\",RaceCard!S24))","v":""},{"$f":"IF(B26=\"\",\"\",IF(RaceCard!X24=\"\",\"\",RaceCard!X24))","v":""},{"$f":"IF(C26=\"\",\"\",IF(RaceCard!Y24=\"\",\"\",RaceCard!Y24))","v":""},{"$f":"IF(D26=\"\",\"\",IF(RaceCard!Z24=\"\",\"\",RaceCard!Z24))","v":""},{"$f":"IF(B26=\"\",\"\",IF(RaceCard!Q24=\"\",\"\",RaceCard!Q24))","v":""},{"$f":"IF(B26=\"\",\"\",IF(RaceCard!P24=\"\",\"\",RaceCard!P24))","v":""},null,25,"12:34 PM-Cambridge-9 (G)",{"$f":"IF(Schedule!A26=\"\",\"\",(Schedule!A26))","v":"G"},{"$f":"IF(Schedule!B26=\"\",\"\",TEXT(Schedule!B26,\"HH:MM AM/PM\"))","v":"12:34 PM"},{"$f":"IF(Schedule!C26=\"\",\"\",(Schedule!C26))","v":"Cambridge"},{"$f":"IF(Schedule!D26=\"\",\"\",(Schedule!D26))","v":"OG"},{"$f":"IF(Schedule!E26=\"\",\"\",(Schedule!E26))","v":9}]
[null,{"$f":"IF(OR(RaceCard!$V25=0,RaceCard!$V25=\"\",RaceCard!$V25>1000),\"\",RaceCard!M25)","v":""},{"$f":"IF(B27=\"\",\"\",RaceCard!N25)","v":""},{"$f":"IF(B27=\"\",\"\",RaceCard!V25)","v":""},{"$f":"IF(B27=\"\",\"\",RaceCard!W25)","v":""},{"$f":"IF(B27=\"\",\"\",RaceCard!U25)","v":""},"",{"$f":"IF(B27=\"\",\"\",RaceCard!O25)","v":""},{"$f":"IF(B27=\"\",\"\",IF($B27=RaceCard!$B$13,1,IF($B27=RaceCard!$C$13,2,IF($B27=RaceCard!$D$13,3,IF($B27=RaceCard!$E$13,4,\"\")))))","v":""},{"$f":"IF($B27=\"\",\"\",IF($B27=RaceCard!$B$14,1,IF($B27=RaceCard!$C$14,2,IF($B27=RaceCard!$D$14,3,IF($B27=RaceCard!$E$14,4,\"\")))))","v":""},{"$f":"IF(B27=\"\",\"\",RaceCard!T25)","v":""},{"$f":"IF(B27=\"\",\"\",IF($B27=RaceCard!$B$12,1,\"\"))","v":""},{"$f":"IF(B27=\"\",\"\",IF(RaceCard!S25=\"\",\"\",RaceCard!S25))","v":""},{"$f":"IF(B27=\"\",\"\",IF(RaceCard!X25=\"\",\"\",RaceCard!X25))","v":""},{"$f":"IF(C27=\"\",\"\",IF(RaceCard!Y25=\"\",\"\",RaceCard!Y25))","v":""},{"$f":"IF(D27=\"\",\"\",IF(RaceCard!Z25=\"\",\"\",RaceCard!Z25))","v":""},{"$f":"IF(B27=\"\",\"\",IF(RaceCard!Q25=\"\",\"\",RaceCard!Q25))","v":""},{"$f":"IF(B27=\"\",\"\",IF(RaceCard!P25=\"\",\"\",RaceCard!P25))","v":""},null,26,"12:36 PM-Sale-2 (R)",{"$f":"IF(Schedule!A27=\"\",\"\",(Schedule!A27))","v":"R"},{"$f":"IF(Schedule!B27=\"\",\"\",TEXT(Schedule!B27,\"HH:MM AM/PM\"))","v":"12:36 PM"},{"$f":"IF(Schedule!C27=\"\",\"\",(Schedule!C27))","v":"Sale"},{"$f":"IF(Schedule!D27=\"\",\"\",(Schedule!D27))","v":"VR"},{"$f":"IF(Schedule!E27=\"\",\"\",(Schedule!E27))","v":2}]
[null,{"$f":"IF(OR(RaceCard!$V26=0,RaceCard!$V26=\"\",RaceCard!$V26>1000),\"\",RaceCard!M26)","v":""},{"$f":"IF(B28=\"\",\"\",RaceCard!N26)","v":""},{"$f":"IF(B28=\"\",\"\",RaceCard!V26)","v":""},{"$f":"IF(B28=\"\",\"\",RaceCard!W26)","v":""},{"$f":"IF(B28=\"\",\"\",RaceCard!U26)","v":""},"",{"$f":"IF(B28=\"\",\"\",RaceCard!O26)","v":""},{"$f":"IF(B28=\"\",\"\",IF($B28=RaceCard!$B$13,1,IF($B28=RaceCard!$C$13,2,IF($B28=RaceCard!$D$13,3,IF($B28=RaceCard!$E$13,4,\"\")))))","v":""},{"$f":"IF($B28=\"\",\"\",IF($B28=RaceCard!$B$14,1,IF($B28=RaceCard!$C$14,2,IF($B28=RaceCard!$D$14,3,IF($B28=RaceCard!$E$14,4,\"\")))))","v":""},{"$f":"IF(B28=\"\",\"\",RaceCard!T26)","v":""},{"$f":"IF(B28=\"\",\"\",IF($B28=RaceCard!$B$12,1,\"\"))","v":""},{"$f":"IF(B28=\"\",\"\",IF(RaceCard!S26=\"\",\"\",RaceCard!S26))","v":""},{"$f":"IF(B28=\"\",\"\",IF(RaceCard!X26=\"\",\"\",RaceCard!X26))","v":""},{"$f":"IF(C28=\"\",\"\",IF(RaceCard!Y26=\"\",\"\",RaceCard!Y26))","v":""},{"$f":"IF(D28=\"\",\"\",IF(RaceCard!Z26=\"\",\"\",RaceCard!Z26))","v":""},{"$f":"IF(B28=\"\",\"\",IF(RaceCard!Q26=\"\",\"\",RaceCard!Q26))","v":""},{"$f":"IF(B28=\"\",\"\",IF(RaceCard!P26=\"\",\"\",RaceCard!P26))","v":""},null,27,"12:40 PM-Goulburn-2 (T)",{"$f":"IF(Schedule!A28=\"\",\"\",(Schedule!A28))","v":"T"},{"$f":"IF(Schedule!B28=\"\",\"\",TEXT(Schedule!B28,\"HH:MM AM/PM\"))","v":"12:40 PM"},{"$f":"IF(Schedule!C28=\"\",\"\",(Schedule!C28))","v":"Goulburn"},{"$f":"IF(Schedule!D28=\"\",\"\",(Schedule!D28))","v":"NT"},{"$f":"IF(Schedule!E28=\"\",\"\",(Schedule!E28))","v":2}]
[{"$nulls":19},28,"12:46 PM-Orange-2 (R)",{"$f":"IF(Schedule!A29=\"\",\"\",(Schedule!A29))","v":"R"},{"$f":"IF(Schedule!B29=\"\",\"\",TEXT(Schedule!B29,\"HH:MM AM/PM\"))","v":"12:46 PM"},{"$f":"IF(Schedule!C29=\"\",\"\",(Schedule!C29))","v":"Orange"},{"$f":"IF(Schedule!D29=\"\",\"\",(Schedule!D29))","v":"CR"},{"$f":"IF(Schedule!E29=\"\",\"\",(Schedule!E29))","v":2}]
[{"$nulls":19},29,"12:50 PM-Ballarat-7 (G)",{"$f":"IF(Schedule!A30=\"\",\"\",(Schedule!A30))","v":"G"},{"$f":"IF(Schedule!B30=\"\",\"\",TEXT(Schedule!B30,\"HH:MM AM/PM\"))","v":"12:50 PM"},{"$f":"IF(Schedule!C30=\"\",\"\",(Schedule!C30))","v":"Ballarat"},{"$f":"IF(Schedule!D30=\"\",\"\",(Schedule!D30))","v":"EG"},{"$f":"IF(Schedule!E30=\"\",\"\",(Schedule!E30))","v":7}]
[{"$nulls":19},30,"12:51 PM-Cambridge-6 (T)",{"$f":"IF(Schedule!A31=\"\",\"\",(Schedule!A31))","v":"T"},{"$f":"IF(Schedule!B31=\"\",\"\",TEXT(Schedule!B31,\"HH:MM AM/PM\"))","v":"12:51 PM"},{"$f":"IF(Schedule!C31=\"\",\"\",(Schedule!C31))","v":"Cambridge"},{"$f":"IF(Schedule!D31=\"\",\"\",(Schedule!D31))","v":"ZT"},{"$f":"IF(Schedule!E31=\"\",\"\",(Schedule!E31))","v":6}]
[{"$nulls":19},31,"12:53 PM-Maryborough-2 (T)",{"$f":"IF(Schedule!A32=\"\",\"\",(Schedule!A32))","v":"T"},{"$f":"IF(Schedule!B32=\"\",\"\",TEXT(Schedule!B32,\"HH:MM AM/PM\"))","v":"12:53 PM"},{"$f":"IF(Schedule!C32=\"\",\"\",(Schedule!C32))","v":"Maryborough"},{"$f":"IF(Schedule!D32=\"\",\"\",(Schedule!D32))","v":"VT"},{"$f":"IF(Schedule!E32=\"\",\"\",(Schedule!E32))","v":2}]
[{"$nulls":19},32,"12:59 PM-Tamworth-2 (R)",{"$f":"IF(Schedule!A33=\"\",\"\",(Schedule!A33))","v":"R"},{"$f":"IF(Schedule!B33=\"\",\"\",TEXT(Schedule!B33,\"HH:MM AM/PM\"))","v":"12:59 PM"},{"$f":"IF(Schedule!C33=\"\",\"\",(Schedule!C33))","v":"Tamworth"},{"$f":"IF(Schedule!D33=\"\",\"\",(Schedule!D33))","v":"NR"},{"$f":"IF(Schedule!E33=\"\",\"\",(Schedule!E33))","v":2}]
[{"$nulls":19},33,"01:03 PM-Globe Derby-1 (T)",{"$f":"IF(Schedule!A34=\"\",\"\",(Schedule!A34))","v":"T"},{"$f":"IF(Schedule!B34=\"\",\"\",TEXT(Schedule!B34,\"HH:MM AM/PM\"))","v":"01:03 PM"},{"$f":"IF(Schedule!C34=\"\",\"\",(Schedule!C34))","v":"Globe Derby"},{"$f":"IF(Schedule!D34=\"\",\"\",(Schedule!D34))","v":"AT"},{"$f":"IF(Schedule!E34=\"\",\"\",(Schedule!E34))","v":1}]
[{"$nulls":19},34,"01:05 PM-Cambridge-10 (G)",{"$f":"IF(Schedule!A35=\"\",\"\",(Schedule!A35))","v":"G"},{"$f":"IF(Schedule!B35=\"\",\"\",TEXT(Schedule!B35,\"HH:MM AM/PM\"))","v":"01:05 PM"},{"$f":"IF(Schedule!C35=\"\",\"\",(Schedule!C35))","v":"Cambridge"},{"$f":"IF(Schedule!D35=\"\",\"\",(Schedule!D35))","v":"OG"},{"$f":"IF(Schedule!E35=\"\",\"\",(Schedule!E35))","v":10}]
[{"$nulls":19},35,"01:09 PM-Ballarat-8 (G)",{"$f":"IF(Schedule!A36=\"\",\"\",(Schedule!A36))","v":"G"},{"$f":"IF(Schedule!B36=\"\",\"\",TEXT(Schedule!B36,\"HH:MM AM/PM\"))","v":"01:09 PM"},{"$f":"IF(Schedule!C36=\"\",\"\",(Schedule!C36))","v":"Ballarat"},{"$f":"IF(Schedule!D36=\"\",\"\",(Schedule!D36))","v":"EG"},{"$f":"IF(Schedule!E36=\"\",\"\",(Schedule!E36))","v":8}]
[{"$nulls":19},36,"01:12 PM-Sale-3 (R)",{"$f":"IF(Schedule!A37=\"\",\"\",(Schedule!A37))","v":"R"},{"$f":"IF(Schedule!B37=\"\",\"\",TEXT(Schedule!B37,\"HH:MM AM/PM\"))","v":"01:12 PM"},{"$f":"IF(Schedule!C37=\"\",\"\",(Schedule!C37))","v":"Sale"},{"$f":"IF(Schedule!D37=\"\",\"\",(Schedule!D37))","v":"VR"},{"$f":"IF(Schedule!E37=\"\",\"\",(Schedule!E37))","v":3}]
[{"$nulls":19},37,"01:16 PM-Goulburn-3 (T)",{"$f":"IF(Schedule!A38=\"\",\"\",(Schedule!A38))","v":"T"},{"$f":"IF(Schedule!B38=\"\",\"\",TEXT(Schedule!B38,\"HH:MM AM/PM\"))","v":"01:16 PM"},{"$f":"IF(Schedule!C38=\"\",\"\",(Schedule!C38))","v":"Goulburn"},{"$f":"IF(Schedule!D38=\"\",\"\",(Schedule!D38))","v":"NT"},{"$f":"IF(Schedule!E38=\"\",\"\",(Schedule!E38))","v":3}]
[{"$nulls":19},38,"01:20 PM-Cambridge-7 (T)",{"$f":"IF(Schedule!A39=\"\",\"\",(Schedule!A39))","v":"T"},{"$f":"IF(Schedule!B39=\"\",\"\",TEXT(Schedule!B39,\"HH:MM AM/PM\"))","v":"01:20 PM"},{"$f":"IF(Schedule!C39=\"\",\"\",(Schedule!C39))","v":"Cambridge"},{"$f":"IF(Schedule!D39=\"\",\"\",(Schedule!D39))","v":"ZT"},{"$f":"IF(Schedule!E39=\"\",\"\",(Schedule!E39))","v":7}]
[{"$nulls":19},39,"01:22 PM-Orange-3 (R)",{"$f":"IF(Schedule!A40=\"\",\"\",(Schedule!A40))","v":"R"},{"$f":"IF(Schedule!B40=\"\",\"\",TEXT(Schedule!B40,\"HH:MM AM/PM\"))","v":"01:22 PM"},{"$f":"IF(Schedule!C40=\"\",\"\",(Schedule!C40))","v":"Orange"},{"$f":"IF(Schedule!D40=\"\",\"\",(Schedule!D40))","v":"CR"},{"$f":"IF(Schedule!E40=\"\",\"\",(Schedule!E40))","v":3}]
[{"$nulls":19},40,"01:26 PM-Ballarat-9 (G)",{"$f":"IF(Schedule!A41=\"\",\"\",(Schedule!A41))","v":"G"},{"$f":"IF(Schedule!B41=\"\",\"\",TEXT(Schedule!B41,\"HH:MM AM/PM\"))","v":"01:26 PM"},{"$f":"IF(Schedule!C41=\"\",\"\",(Schedule!C41))","v":"Ballarat"},{"$f":"IF(Schedule!D41=\"\",\"\",(Schedule!D41))","v":"EG"},{"$f":"IF(Schedule!E41=\"\",\"\",(Schedule!E41))","v":9}]
[{"$nulls":19},41,"01:29 PM-Maryborough-3 (T)",{"$f":"IF(Schedule!A42=\"\",\"\",(Schedule!A42))","v":"T"},{"$f":"IF(Schedule!B42=\"\",\"\",TEXT(Schedule!B42,\"HH:MM AM/PM\"))","v":"01:29 PM"},{"$f":"IF(Schedule!C42=\"\",\"\",(Schedule!C42))","v":"Maryborough"},{"$f":"IF(Schedule!D42=\"\",\"\",(Schedule!D42))","v":"VT"},{"$f":"IF(Schedule!E42=\"\",\"\",(Schedule!E42))","v":3}]
[{"$nulls":19},42,"01:35 PM-Tamworth-3 (R)",{"$f":"IF(Schedule!A43=\"\",\"\",(Schedule!A43))","v":"R"},{"$f":"IF(Schedule!B43=\"\",\"\",TEXT(Schedule!B43,\"HH:MM AM/PM\"))","v":"01:35 PM"},{"$f":"IF(Schedule!C43=\"\",\"\",(Schedule!C43))","v":"Tamworth"},{"$f":"IF(Schedule!D43=\"\",\"\",(Schedule!D43))","v":"NR"},{"$f":"IF(Schedule!E43=\"\",\"\",(Schedule!E43))","v":3}]
[{"$nulls":19},43,"01:39 PM-Globe Derby-2 (T)",{"$f":"IF(Schedule!A44=\"\",\"\",(Schedule!A44))","v":"T"},{"$f":"IF(Schedule!B44=\"\",\"\",TEXT(Schedule!B44,\"HH:MM AM/PM\"))","v":"01:39 PM"},{"$f":"IF(Schedule!C44=\"\",\"\",(Schedule!C44))","v":"Globe Derby"},{"$f":"IF(Schedule!D44=\"\",\"\",(Schedule!D44))","v":"AT"},{"$f":"IF(Schedule!E44=\"\",\"\",(Schedule!E44))","v":2}]
[{"$nulls":19},44,"01:40 PM-New Zealand-1 (G)",{"$f":"IF(Schedule!A45=\"\",\"\",(Schedule!A45))","v":"G"},{"$f":"IF(Schedule!B45=\"\",\"\",TEXT(Schedule!B45,\"HH:MM AM/PM\"))","v":"01:40 PM"},{"$f":"IF(Schedule!C45=\"\",\"\",(Schedule!C45))","v":"New Zealand"},{"$f":"IF(Schedule!D45=\"\",\"\",(Schedule!D45))","v":"ZG"},{"$f":"IF(Schedule!E45=\"\",\"\",(Schedule!E45))","v":1}]
[{"$nulls":19},45,"01:45 PM-Ballarat-10 (G)",{"$f":"IF(Schedule!A46=\"\",\"\",(Schedule!A46))","v":"G"},{"$f":"IF(Schedule!B46=\"\",\"\",TEXT(Schedule!B46,\"HH:MM AM/PM\"))","v":"01:45 PM"},{"$f":"IF(Schedule!C46=\"\",\"\",(Schedule!C46))","v":"Ballarat"},{"$f":"IF(Schedule!D46=\"\",\"\",(Schedule!D46))","v":"EG"},{"$f":"IF(Schedule!E46=\"\",\"\",(Schedule!E46))","v":10}]
[{"$nulls":19},46,"01:48 PM-Sale-4 (R)",{"$f":"IF(Schedule!A47=\"\",\"\",(Schedule!A47))","v":"R"},{"$f":"IF(Schedule!B47=\"\",\"\",TEXT(Schedule!B47,\"HH:MM AM/PM\"))","v":"01:48 PM"},{"$f":"IF(Schedule!C47=\"\",\"\",(Schedule!C47))","v":"Sale"},{"$f":"IF(Schedule!D47=\"\",\"\",(Schedule!D47))","v":"VR"},{"$f":"IF(Schedule!E47=\"\",\"\",(Schedule!E47))","v":4}]
[{"$nulls":19},47,"01:52 PM-Goulburn-4 (T)",{"$f":"IF(Schedule!A48=\"\",\"\",(Schedule!A48))","v":"T"},{"$f":"IF(Schedule!B48=\"\",\"\",TEXT(Schedule!B48,\"HH:MM AM/PM\"))","v":"01:52 PM"},{"$f":"IF(Schedule!C48=\"\",\"\",(Schedule!C48))","v":"Goulburn"},{"$f":"IF(Schedule!D48=\"\",\"\",(Schedule!D48))","v":"NT"},{"$f":"IF(Schedule!E48=\"\",\"\",(Schedule!E48))","v":4}]
[{"$nulls":19},48,"01:54 PM-Cambridge-8 (T)",{"$f":"IF(Schedule!A49=\"\",\"\",(Schedule!A49))","v":"T"},{"$f":"IF(Schedule!B49=\"\",\"\",TEXT(Schedule!B49,\"HH:MM AM/PM\"))","v":"01:54 PM"},{"$f":"IF(Schedule!C49=\"\",\"\",(Schedule!C49))","v":"Cambridge"},{"$f":"IF(Schedule!D49=\"\",\"\",(Schedule!D49))","v":"ZT"},{"$f":"IF(Schedule!E49=\"\",\"\",(Schedule!E49))","v":8}]
[1,{"$nulls":18},49,"01:58 PM-Orange-4 (R)",{"$f":"IF(Schedule!A50=\"\",\"\",(Schedule!A50))","v":"R"},{"$f":"IF(Schedule!B50=\"\",\"\",TEXT(Schedule!B50,\"HH:MM AM/PM\"))","v":"01:58 PM"},{"$f":"IF(Schedule!C50=\"\",\"\",(Schedule!C50))","v":"Orange"},{"$f":"IF(Schedule!D50=\"\",\"\",(Schedule!D50))","v":"CR"},{"$f":"IF(Schedule!E50=\"\",\"\",(Schedule!E50))","v":4}]
[2,{"$nulls":18},50,"02:02 PM-Ballarat-11 (G)",{"$f":"IF(Schedule!A51=\"\",\"\",(Schedule!A51))","v":"G"},{"$f":"IF(Schedule!B51=\"\",\"\",TEXT(Schedule!B51,\"HH:MM AM/PM\"))","v":"02:02 PM"},{"$f":"IF(Schedule!C51=\"\",\"\",(Schedule!C51))","v":"Ballarat"},{"$f":"IF(Schedule!D51=\"\",\"\",(Schedule!D51))","v":"EG"},{"$f":"IF(Schedule!E51=\"\",\"\",(Schedule!E51))","v":11}]
[3,{"$nulls":18},51,"02:05 PM-Maryborough-4 (T)",{"$f":"IF(Schedule!A52=\"\",\"\",(Schedule!A52))","v":"T"},{"$f":"IF(Schedule!B52=\"\",\"\",TEXT(Schedule!B52,\"HH:MM AM/PM\"))","v":"02:05 PM"},{"$f":"IF(Schedule!C52=\"\",\"\",(Schedule!C52))","v":"Maryborough"},{"$f":"IF(Schedule!D52=\"\",\"\",(Schedule!D52))","v":"VT"},{"$f":"IF(Schedule!E52=\"\",\"\",(Schedule!E52))","v":4}]
[4,{"$nulls":18},52,"02:11 PM-Tamworth-4 (R)",{"$f":"IF(Schedule!A53=\"\",\"\",(Schedule!A53))","v":"R"},{"$f":"IF(Schedule!B53=\"\",\"\",TEXT(Schedule!B53,\"HH:MM AM/PM\"))","v":"02:11 PM"},{"$f":"IF(Schedule!C53=\"\",\"\",(Schedule!C53))","v":"Tamworth"},{"$f":"IF(Schedule!D53=\"\",\"\",(Schedule!D53))","v":"NR"},{"$f":"IF(Schedule!E53=\"\",\"\",(Schedule!E53))","v":4}]
[5,{"$nulls":18},53,"02:15 PM-Globe Derby-3 (T)",{"$f":"IF(Schedule!A54=\"\",\"\",(Schedule!A54))","v":"T"},{"$f":"IF(Schedule!B54=\"\",\"\",TEXT(Schedule!B54,\"HH:MM AM/PM\"))","v":"02:15 PM"},{"$f":"IF(Schedule!C54=\"\",\"\",(Schedule!C54))","v":"Globe Derby"},{"$f":"IF(Schedule!D54=\"\",\"\",(Schedule!D54))","v":"AT"},{"$f":"IF(Schedule!E54=\"\",\"\",(Schedule!E54))","v":3}]
[6,{"$nulls":18},54,"02:16 PM-New Zealand-2 (G)",{"$f":"IF(Schedule!A55=\"\",\"\",(Schedule!A55))","v":"G"},{"$f":"IF(Schedule!B55=\"\",\"\",TEXT(Schedule!B55,\"HH:MM AM/PM\"))","v":"02:16 PM"},{"$f":"IF(Schedule!C55=\"\",\"\",(Schedule!C55))","v":"New Zealand"},{"$f":"IF(Schedule!D55=\"\",\"\",(Schedule!D55))","v":"ZG"},{"$f":"IF(Schedule!E55=\"\",\"\",(Schedule!E55))","v":2}]
[{"$nulls":19},55,"02:21 PM-Ballarat-12 (G)",{"$f":"IF(Schedule!A56=\"\",\"\",(Schedule!A56))","v":"G"},{"$f":"IF(Schedule!B56=\"\",\"\",TEXT(Schedule!B56,\"HH:MM AM/PM\"))","v":"02:21 PM"},{"$f":"IF(Schedule!C56=\"\",\"\",(Schedule!C56))","v":"Ballarat"},{"$f":"IF(Schedule!D56=\"\",\"\",(Schedule!D56))","v":"EG"},{"$f":"IF(Schedule!E56=\"\",\"\",(Schedule!E56))","v":12}]
[{"$nulls":19},56,"02:25 PM-Sale-5 (R)",{"$f":"IF(Schedule!A57=\"\",\"\",(Schedule!A57))","v":"R"},{"$f":"IF(Schedule!B57=\"\",\"\",TEXT(Schedule!B57,\"HH:MM AM/PM\"))","v":"02:25 PM"},{"$f":"IF(Schedule!C57=\"\",\"\",(Schedule!C57))","v":"Sale"},{"$f":"IF(Schedule!D57=\"\",\"\",(Schedule!D57))","v":"VR"},{"$f":"IF(Schedule!E57=\"\",\"\",(Schedule!E57))","v":5}]
[{"$nulls":19},57,"02:30 PM-Goulburn-5 (T)",{"$f":"IF(Schedule!A58=\"\",\"\",(Schedule!A58))","v":"T"},{"$f":"IF(Schedule!B58=\"\",\"\",TEXT(Schedule!B58,\"HH:MM AM/PM\"))","v":"02:30 PM"},{"$f":"IF(Schedule!C58=\"\",\"\",(Schedule!C58))","v":"Goulburn"},{"$f":"IF(Schedule!D58=\"\",\"\",(Schedule!D58))","v":"NT"},{"$f":"IF(Schedule!E58=\"\",\"\",(Schedule!E58))","v":5}]
[{"$nulls":19},58,"02:30 PM-Cambridge-9 (T)",{"$f":"IF(Schedule!A59=\"\",\"\",(Schedule!A59))","v":"T"},{"$f":"IF(Schedule!B59=\"\",\"\",TEXT(Schedule!B59,\"HH:MM AM/PM\"))","v":"02:30 PM"},{"$f":"IF(Schedule!C59=\"\",\"\",(Schedule!C59))","v":"Cambridge"},{"$f":"IF(Schedule!D59=\"\",\"\",(Schedule!D59))","v":"ZT"},{"$f":"IF(Schedule!E59=\"\",\"\",(Schedule!E59))","v":9}]
[{"$nulls":19},59,"02:35 PM-Orange-5 (R)",{"$f":"IF(Schedule!A60=\"\",\"\",(Schedule!A60))","v":"R"},{"$f":"IF(Schedule!B60=\"\",\"\",TEXT(Schedule!B60,\"HH:MM AM/PM\"))","v":"02:35 PM"},{"$f":"IF(Schedule!C60=\"\",\"\",(Schedule!C60))","v":"Orange"},{"$f":"IF(Schedule!D60=\"\",\"\",(Schedule!D60))","v":"CR"},{"$f":"IF(Schedule!E60=\"\",\"\",(Schedule!E60))","v":5}]
[{"$nulls":19},60,"02:40 PM-Maryborough-5 (T)",{"$f":"IF(Schedule!A61=\"\",\"\",(Schedule!A61))","v":"T"},{"$f":"IF(Schedule!B61=\"\",\"\",TEXT(Schedule!B61,\"HH:MM AM/PM\"))","v":"02:40 PM"},{"$f":"IF(Schedule!C61=\"\",\"\",(Schedule!C61))","v":"Maryborough"},{"$f":"IF(Schedule!D61=\"\",\"\",(Schedule!D61))","v":"VT"},{"$f":"IF(Schedule!E61=\"\",\"\",(Schedule!E61))","v":5}]
[{"$nulls":19},61,"02:45 PM-Pinjarra-1 (T)",{"$f":"IF(Schedule!A62=\"\",\"\",(Schedule!A62))","v":"T"},{"$f":"IF(Schedule!B62=\"\",\"\",TEXT(Schedule!B62,\"HH:MM AM/PM\"))","v":"02:45 PM"},{"$f":"IF(Schedule!C62=\"\",\"\",(Schedule!C62))","v":"Pinjarra"},{"$f":"IF(Schedule!D62=\"\",\"\",(Schedule!D62))","v":"PT"},{"$f":"IF(Schedule!E62=\"\",\"\",(Schedule!E62))","v":1}]
[{"$nulls":19},62,"02:45 PM-New Zealand-3 (G)",{"$f":"IF(Schedule!A63=\"\",\"\",(Schedule!A63))","v":"G"},{"$f":"IF(Schedule!B63=\"\",\"\",TEXT(Schedule!B63,\"HH:MM AM/PM\"))","v":"02:45 PM"},{"$f":"IF(Schedule!C63=\"\",\"\",(Schedule!C63))","v":"New Zealand"},{"$f":"IF(Schedule!D63=\"\",\"\",(Schedule!D63))","v":"ZG"},{"$f":"IF(Schedule!E63=\"\",\"\",(Schedule!E63))","v":3}]
[{"$nulls":19},63,"02:50 PM-Tamworth-5 (R)",{"$f":"IF(Schedule!A64=\"\",\"\",(Schedule!A64))","v":"R"},{"$f":"IF(Schedule!B64=\"\",\"\",TEXT(Schedule!B64,\"HH:MM AM/PM\"))","v":"02:50 PM"},{"$f":"IF(Schedule!C64=\"\",\"\",(Schedule!C64))","v":"Tamworth"},{"$f":"IF(Schedule!D64=\"\",\"\",(Schedule!D64))","v":"NR"},{"$f":"IF(Schedule!E64=\"\",\"\",(Schedule!E64))","v":5}]
[{"$nulls":19},64,"02:55 PM-Globe Derby-4 (T)",{"$f":"IF(Schedule!A65=\"\",\"\",(Schedule!A65))","v":"T"},{"$f":"IF(Schedule!B65=\"\",\"\",TEXT(Schedule!B65,\"HH:MM AM/PM\"))","v":"02:55 PM"},{"$f":"IF(Schedule!C65=\"\",\"\",(Schedule!C65))","v":"Globe Derby"},{"$f":"IF(Schedule!D65=\"\",\"\",(Schedule!D65))","v":"AT"},{"$f":"IF(Schedule!E65=\"\",\"\",(Schedule!E65))","v":4}]
[{"$nulls":19},65,"03:00 PM-Sale-6 (R)",{"$f":"IF(Schedule!A66=\"\",\"\",(Schedule!A66))","v":"R"},{"$f":"IF(Schedule!B66=\"\",\"\",TEXT(Schedule!B66,\"HH:MM AM/PM\"))","v":"03:00 PM"},{"$f":"IF(Schedule!C66=\"\",\"\",(Schedule!C66))","v":"Sale"},{"$f":"IF(Schedule!D66=\"\",\"\",(Schedule!D66))","v":"VR"},{"$f":"IF(Schedule!E66=\"\",\"\",(Schedule!E66))","v":6}]
[{"$nulls":19},66,{"$f":"IF(V67=\"\",\"\",CONCATENATE(TEXT(W67,\"HH:MM AM/PM\"),\"-\",X67,\"-\",Z67,\" (\",V67,\")\"))","v":"03:03 PM-Goulburn-6 (T)"},{"$f":"IF(Schedule!A67=\"\",\"\",(Schedule!A67))","v":"T"},{"$f":"IF(Schedule!B67=\"\",\"\",TEXT(Schedule!B67,\"HH:MM AM/PM\"))","v":"03:03 PM"},{"$f":"IF(Schedule!C67=\"\",\"\",(Schedule!C67))","v":"Goulburn"},{"$f":"IF(Schedule!D67=\"\",\"\",(Schedule!D67))","v":"NT"},{"$f":"IF(Schedule!E67=\"\",\"\",(Schedule!E67))","v":6}]
[{"$nulls":19},67,"03:05 PM-Cambridge-10 (T)",{"$f":"IF(Schedule!A68=\"\",\"\",(Schedule!A68))","v":"T"},{"$f":"IF(Schedule!B68=\"\",\"\",TEXT(Schedule!B68,\"HH:MM AM/PM\"))","v":"03:05 PM"},{"$f":"IF(Schedule!C68=\"\",\"\",(Schedule!C68))","v":"Cambridge"},{"$f":"IF(Schedule!D68=\"\",\"\",(Schedule!D68))","v":"ZT"},{"$f":"IF(Schedule!E68=\"\",\"\",(Schedule!E68))","v":10}]
[{"$nulls":19},68,"03:07 PM-Cranbourne-1 (G)",{"$f":"IF(Schedule!A69=\"\",\"\",(Schedule!A69))","v":"G"},{"$f":"IF(Schedule!B69=\"\",\"\",TEXT(Schedule!B69,\"HH:MM AM/PM\"))","v":"03:07 PM"},{"$f":"IF(Schedule!C69=\"\",\"\",(Schedule!C69))","v":"Cranbourne"},{"$f":"IF(Schedule!D69=\"\",\"\",(Schedule!D69))","v":"VG"},{"$f":"IF(Schedule!E69=\"\",\"\",(Schedule!E69))","v":1}]
[{"$nulls":19},69,"03:10 PM-Orange-6 (R)",{"$f":"IF(Schedule!A70=\"\",\"\",(Schedule!A70))","v":"R"},{"$f":"IF(Schedule!B70=\"\",\"\",TEXT(Schedule!B70,\"HH:MM AM/PM\"))","v":"03:10 PM"},{"$f":"IF(Schedule!C70=\"\",\"\",(Schedule!C70))","v":"Orange"},{"$f":"IF(Schedule!D70=\"\",\"\",(Schedule!D70))","v":"CR"},{"$f":"IF(Schedule!E70=\"\",\"\",(Schedule!E70))","v":6}]
[{"$nulls":19},70,"03:13 PM-Maryborough-6 (T)",{"$f":"IF(Schedule!A71=\"\",\"\",(Schedule!A71))","v":"T"},{"$f":"IF(Schedule!B71=\"\",\"\",TEXT(Schedule!B71,\"HH:MM AM/PM\"))","v":"03:13 PM"},{"$f":"IF(Schedule!C71=\"\",\"\",(Schedule!C71))","v":"Maryborough"},{"$f":"IF(Schedule!D71=\"\",\"\",(Schedule!D71))","v":"VT"},{"$f":"IF(Schedule!E71=\"\",\"\",(Schedule!E71))","v":6}]
[{"$nulls":19},71,"03:17 PM-Bathurst-1 (G)",{"$f":"IF(Schedule!A72=\"\",\"\",(Schedule!A72))","v":"G"},{"$f":"IF(Schedule!B72=\"\",\"\",TEXT(Schedule!B72,\"HH:MM AM/PM\"))","v":"03:17 PM"},{"$f":"IF(Schedule!C72=\"\",\"\",(Schedule!C72))","v":"Bathurst"},{"$f":"IF(Schedule!D72=\"\",\"\",(Schedule!D72))","v":"NG"},{"$f":"IF(Schedule!E72=\"\",\"\",(Schedule!E72))","v":1}]
[{"$nulls":19},72,"03:20 PM-Pinjarra-2 (T)",{"$f":"IF(Schedule!A73=\"\",\"\",(Schedule!A73))","v":"T"},{"$f":"IF(Schedule!B73=\"\",\"\",TEXT(Schedule!B73,\"HH:MM AM/PM\"))","v":"03:20 PM"},{"$f":"IF(Schedule!C73=\"\",\"\",(Schedule!C73))","v":"Pinjarra"},{"$f":"IF(Schedule!D73=\"\",\"\",(Schedule!D73))","v":"PT"},{"$f":"IF(Schedule!E73=\"\",\"\",(Schedule!E73))","v":2}]
[{"$nulls":19},73,"03:20 PM-New Zealand-4 (G)",{"$f":"IF(Schedule!A74=\"\",\"\",(Schedule!A74))","v":"G"},{"$f":"IF(Schedule!B74=\"\",\"\",TEXT(Schedule!B74,\"HH:MM AM/PM\"))","v":"03:20 PM"},{"$f":"IF(Schedule!C74=\"\",\"\",(Schedule!C74))","v":"New Zealand"},{"$f":"IF(Schedule!D74=\"\",\"\",(Schedule!D74))","v":"ZG"},{"$f":"IF(Schedule!E74=\"\",\"\",(Schedule!E74))","v":4}]
[{"$nulls":19},74,"03:25 PM-Tamworth-6 (R)",{"$f":"IF(Schedule!A75=\"\",\"\",(Schedule!A75))","v":"R"},{"$f":"IF(Schedule!B75=\"\",\"\",TEXT(Schedule!B75,\"HH:MM AM/PM\"))","v":"03:25 PM"},{"$f":"IF(Schedule!C75=\"\",\"\",(Schedule!C75))","v":"Tamworth"},{"$f":"IF(Schedule!D75=\"\",\"\",(Schedule!D75))","v":"NR"},{"$f":"IF(Schedule!E75=\"\",\"\",(Schedule!E75))","v":6}]
[{"$nulls":19},75,"03:29 PM-Cranbourne-2 (G)",{"$f":"IF(Schedule!A76=\"\",\"\",(Schedule!A76))","v":"G"},{"$f":"IF(Schedule!B76=\"\",\"\",TEXT(Schedule!B76,\"HH:MM AM/PM\"))","v":"03:29 PM"},{"$f":"IF(Schedule!C76=\"\",\"\",(Schedule!C76))","v":"Cranbourne"},{"$f":"IF(Schedule!D76=\"\",\"\",(Schedule!D76))","v":"VG"},{"$f":"IF(Schedule!E76=\"\",\"\",(Schedule!E76))","v":2}]
[{"$nulls":19},76,"03:32 PM-Globe Derby-5 (T)",{"$f":"IF(Schedule!A77=\"\",\"\",(Schedule!A77))","v":"T"},{"$f":"IF(Schedule!B77=\"\",\"\",TEXT(Schedule!B77,\"HH:MM AM/PM\"))","v":"03:32 PM"},{"$f":"IF(Schedule!C77=\"\",\"\",(Schedule!C77))","v":"Globe Derby"},{"$f":"IF(Schedule!D77=\"\",\"\",(Schedule!D77))","v":"AT"},{"$f":"IF(Schedule!E77=\"\",\"\",(Schedule!E77))","v":5}]
[{"$nulls":19},77,"03:37 PM-Bathurst-2 (G)",{"$f":"IF(Schedule!A78=\"\",\"\",(Schedule!A78))","v":"G"},{"$f":"IF(Schedule!B78=\"\",\"\",TEXT(Schedule!B78,\"HH:MM AM/PM\"))","v":"03:37 PM"},{"$f":"IF(Schedule!C78=\"\",\"\",(Schedule!C78))","v":"Bathurst"},{"$f":"IF(Schedule!D78=\"\",\"\",(Schedule!D78))","v":"NG"},{"$f":"IF(Schedule!E78=\"\",\"\",(Schedule!E78))","v":2}]
[{"$nulls":19},78,"03:40 PM-Sale-7 (R)",{"$f":"IF(Schedule!A79=\"\",\"\",(Schedule!A79))","v":"R"},{"$f":"IF(Schedule!B79=\"\",\"\",TEXT(Schedule!B79,\"HH:MM AM/PM\"))","v":"03:40 PM"},{"$f":"IF(Schedule!C79=\"\",\"\",(Schedule!C79))","v":"Sale"},{"$f":"IF(Schedule!D79=\"\",\"\",(Schedule!D79))","v":"VR"},{"$f":"IF(Schedule!E79=\"\",\"\",(Schedule!E79))","v":7}]
[{"$nulls":19},79,"03:43 PM-Goulburn-7 (T)",{"$f":"IF(Schedule!A80=\"\",\"\",(Schedule!A80))","v":"T"},{"$f":"IF(Schedule!B80=\"\",\"\",TEXT(Schedule!B80,\"HH:MM AM/PM\"))","v":"03:43 PM"},{"$f":"IF(Schedule!C80=\"\",\"\",(Schedule!C80))","v":"Goulburn"},{"$f":"IF(Schedule!D80=\"\",\"\",(Schedule!D80))","v":"NT"},{"$f":"IF(Schedule!E80=\"\",\"\",(Schedule!E80))","v":7}]
[{"$nulls":19},80,"03:47 PM-Cranbourne-3 (G)",{"$f":"IF(Schedule!A81=\"\",\"\",(Schedule!A81))","v":"G"},{"$f":"IF(Schedule!B81=\"\",\"\",TEXT(Schedule!B81,\"HH:MM AM/PM\"))","v":"03:47 PM"},{"$f":"IF(Schedule!C81=\"\",\"\",(Schedule!C81))","v":"Cranbourne"},{"$f":"IF(Schedule!D81=\"\",\"\",(Schedule!D81))","v":"VG"},{"$f":"IF(Schedule!E81=\"\",\"\",(Schedule!E81))","v":3}]
[{"$nulls":19},81,"03:50 PM-Orange-7 (R)",{"$f":"IF(Schedule!A82=\"\",\"\",(Schedule!A82))","v":"R"},{"$f":"IF(Schedule!B82=\"\",\"\",TEXT(Schedule!B82,\"HH:MM AM/PM\"))","v":"03:50 PM"},{"$f":"IF(Schedule!C82=\"\",\"\",(Schedule!C82))","v":"Orange"},{"$f":"IF(Schedule!D82=\"\",\"\",(Schedule!D82))","v":"CR"},{"$f":"IF(Schedule!E82=\"\",\"\",(Schedule!E82))","v":7}]
[{"$nulls":19},82,"03:50 PM-New Zealand-5 (G)",{"$f":"IF(Schedule!A83=\"\",\"\",(Schedule!A83))","v":"G"},{"$f":"IF(Schedule!B83=\"\",\"\",TEXT(Schedule!B83,\"HH:MM AM/PM\"))","v":"03:50 PM"},{"$f":"IF(Schedule!C83=\"\",\"\",(Schedule!C83))","v":"New Zealand"},{"$f":"IF(Schedule!D83=\"\",\"\",(Schedule!D83))","v":"ZG"},{"$f":"IF(Schedule!E83=\"\",\"\",(Schedule!E83))","v":5}]
[{"$nulls":19},83,"03:53 PM-Maryborough-7 (T)",{"$f":"IF(Schedule!A84=\"\",\"\",(Schedule!A84))","v":"T"},{"$f":"IF(Schedule!B84=\"\",\"\",TEXT(Schedule!B84,\"HH:MM AM/PM\"))","v":"03:53 PM"},{"$f":"IF(Schedule!C84=\"\",\"\",(Schedule!C84))","v":"Maryborough"},{"$f":"IF(Schedule!D84=\"\",\"\",(Schedule!D84))","v":"VT"},{"$f":"IF(Schedule!E84=\"\",\"\",(Schedule!E84))","v":7}]
[{"$nulls":19},84,"03:57 PM-Bathurst-3 (G)",{"$f":"IF(Schedule!A85=\"\",\"\",(Schedule!A85))","v":"G"},{"$f":"IF(Schedule!B85=\"\",\"\",TEXT(Schedule!B85,\"HH:MM AM/PM\"))","v":"03:57 PM"},{"$f":"IF(Schedule!C85=\"\",\"\",(Schedule!C85))","v":"Bathurst"},{"$f":"IF(Schedule!D85=\"\",\"\",(Schedule!D85))","v":"NG"},{"$f":"IF(Schedule!E85=\"\",\"\",(Schedule!E85))","v":3}]
[{"$nulls":19},85,"04:00 PM-Pinjarra-3 (T)",{"$f":"IF(Schedule!A86=\"\",\"\",(Schedule!A86))","v":"T"},{"$f":"IF(Schedule!B86=\"\",\"\",TEXT(Schedule!B86,\"HH:MM AM/PM\"))","v":"04:00 PM"},{"$f":"IF(Schedule!C86=\"\",\"\",(Schedule!C86))","v":"Pinjarra"},{"$f":"IF(Schedule!D86=\"\",\"\",(Schedule!D86))","v":"PT"},{"$f":"IF(Schedule!E86=\"\",\"\",(Schedule!E86))","v":3}]
[{"$nulls":19},86,"04:05 PM-Tamworth-7 (R)",{"$f":"IF(Schedule!A87=\"\",\"\",(Schedule!A87))","v":"R"},{"$f":"IF(Schedule!B87=\"\",\"\",TEXT(Schedule!B87,\"HH:MM AM/PM\"))","v":"04:05 PM"},{"$f":"IF(Schedule!C87=\"\",\"\",(Schedule!C87))","v":"Tamworth"},{"$f":"IF(Schedule!D87=\"\",\"\",(Schedule!D87))","v":"NR"},{"$f":"IF(Schedule!E87=\"\",\"\",(Schedule!E87))","v":7}]
[{"$nulls":19},87,"04:09 PM-Cranbourne-4 (G)",{"$f":"IF(Schedule!A88=\"\",\"\",(Schedule!A88))","v":"G"},{"$f":"IF(Schedule!B88=\"\",\"\",TEXT(Schedule!B88,\"HH:MM AM/PM\"))","v":"04:09 PM"},{"$f":"IF(Schedule!C88=\"\",\"\",(Schedule!C88))","v":"Cranbourne"},{"$f":"IF(Schedule!D88=\"\",\"\",(Schedule!D88))","v":"VG"},{"$f":"IF(Schedule!E88=\"\",\"\",(Schedule!E88))","v":4}]
[{"$nulls":19},88,"04:10 PM-New Zealand-6 (G)",{"$f":"IF(Schedule!A89=\"\",\"\",(Schedule!A89))","v":"G"},{"$f":"IF(Schedule!B89=\"\",\"\",TEXT(Schedule!B89,\"HH:MM AM/PM\"))","v":"04:10 PM"},{"$f":"IF(Schedule!C89=\"\",\"\",(Schedule!C89))","v":"New Zealand"},{"$f":"IF(Schedule!D89=\"\",\"\",(Schedule!D89))","v":"ZG"},{"$f":"IF(Schedule!E89=\"\",\"\",(Schedule!E89))","v":6}]
[{"$nulls":19},89,"04:12 PM-Globe Derby-6 (T)",{"$f":"IF(Schedule!A90=\"\",\"\",(Schedule!A90))","v":"T"},{"$f":"IF(Schedule!B90=\"\",\"\",TEXT(Schedule!B90,\"HH:MM AM/PM\"))","v":"04:12 PM"},{"$f":"IF(Schedule!C90=\"\",\"\",(Schedule!C90))","v":"Globe Derby"},{"$f":"IF(Schedule!D90=\"\",\"\",(Schedule!D90))","v":"AT"},{"$f":"IF(Schedule!E90=\"\",\"\",(Schedule!E90))","v":6}]
[{"$nulls":19},90,"04:17 PM-Bathurst-4 (G)",{"$f":"IF(Schedule!A91=\"\",\"\",(Schedule!A91))","v":"G"},{"$f":"IF(Schedule!B91=\"\",\"\",TEXT(Schedule!B91,\"HH:MM AM/PM\"))","v":"04:17 PM"},{"$f":"IF(Schedule!C91=\"\",\"\",(Schedule!C91))","v":"Bathurst"},{"$f":"IF(Schedule!D91=\"\",\"\",(Schedule!D91))","v":"NG"},{"$f":"IF(Schedule!E91=\"\",\"\",(Schedule!E91))","v":4}]
[{"$nulls":19},91,"04:20 PM-Sale-8 (R)",{"$f":"IF(Schedule!A92=\"\",\"\",(Schedule!A92))","v":"R"},{"$f":"IF(Schedule!B92=\"\",\"\",TEXT(Schedule!B92,\"HH:MM AM/PM\"))","v":"04:20 PM"},{"$f":"IF(Schedule!C92=\"\",\"\",(Schedule!C92))","v":"Sale"},{"$f":"IF(Schedule!D92=\"\",\"\",(Schedule!D92))","v":"VR"},{"$f":"IF(Schedule!E92=\"\",\"\",(Schedule!E92))","v":8}]
[{"$nulls":19},92,"04:23 PM-Goulburn-8 (T)",{"$f":"IF(Schedule!A93=\"\",\"\",(Schedule!A93))","v":"T"},{"$f":"IF(Schedule!B93=\"\",\"\",TEXT(Schedule!B93,\"HH:MM AM/PM\"))","v":"04:23 PM"},{"$f":"IF(Schedule!C93=\"\",\"\",(Schedule!C93))","v":"Goulburn"},{"$f":"IF(Schedule!D93=\"\",\"\",(Schedule!D93))","v":"NT"},{"$f":"IF(Schedule!E93=\"\",\"\",(Schedule!E93))","v":8}]
[{"$nulls":19},93,"04:27 PM-Cranbourne-5 (G)",{"$f":"IF(Schedule!A94=\"\",\"\",(Schedule!A94))","v":"G"},{"$f":"IF(Schedule!B94=\"\",\"\",TEXT(Schedule!B94,\"HH:MM AM/PM\"))","v":"04:27 PM"},{"$f":"IF(Schedule!C94=\"\",\"\",(Schedule!C94))","v":"Cranbourne"},{"$f":"IF(Schedule!D94=\"\",\"\",(Schedule!D94))","v":"VG"},{"$f":"IF(Schedule!E94=\"\",\"\",(Schedule!E94))","v":5}]
[{"$nulls":19},94,"04:27 PM-New Zealand-7 (G)",{"$f":"IF(Schedule!A95=\"\",\"\",(Schedule!A95))","v":"G"},{"$f":"IF(Schedule!B95=\"\",\"\",TEXT(Schedule!B95,\"HH:MM AM/PM\"))","v":"04:27 PM"},{"$f":"IF(Schedule!C95=\"\",\"\",(Schedule!C95))","v":"New Zealand"},{"$f":"IF(Schedule!D95=\"\",\"\",(Schedule!D95))","v":"ZG"},{"$f":"IF(Schedule!E95=\"\",\"\",(Schedule!E95))","v":7}]
[{"$nulls":19},95,"04:33 PM-Maryborough-8 (T)",{"$f":"IF(Schedule!A96=\"\",\"\",(Schedule!A96))","v":"T"},{"$f":"IF(Schedule!B96=\"\",\"\",TEXT(Schedule!B96,\"HH:MM AM/PM\"))","v":"04:33 PM"},{"$f":"IF(Schedule!C96=\"\",\"\",(Schedule!C96))","v":"Maryborough"},{"$f":"IF(Schedule!D96=\"\",\"\",(Schedule!D96))","v":"VT"},{"$f":"IF(Schedule!E96=\"\",\"\",(Schedule!E96))","v":8}]
[{"$nulls":19},96,"04:37 PM-Bathurst-5 (G)",{"$f":"IF(Schedule!A97=\"\",\"\",(Schedule!A97))","v":"G"},{"$f":"IF(Schedule!B97=\"\",\"\",TEXT(Schedule!B97,\"HH:MM AM/PM\"))","v":"04:37 PM"},{"$f":"IF(Schedule!C97=\"\",\"\",(Schedule!C97))","v":"Bathurst"},{"$f":"IF(Schedule!D97=\"\",\"\",(Schedule!D97))","v":"NG"},{"$f":"IF(Schedule!E97=\"\",\"\",(Schedule!E97))","v":5}]
[{"$nulls":19},97,"04:40 PM-Pinjarra-4 (T)",{"$f":"IF(Schedule!A98=\"\",\"\",(Schedule!A98))","v":"T"},{"$f":"IF(Schedule!B98=\"\",\"\",TEXT(Schedule!B98,\"HH:MM AM/PM\"))","v":"04:40 PM"},{"$f":"IF(Schedule!C98=\"\",\"\",(Schedule!C98))","v":"Pinjarra"},{"$f":"IF(Schedule!D98=\"\",\"\",(Schedule!D98))","v":"PT"},{"$f":"IF(Schedule!E98=\"\",\"\",(Schedule!E98))","v":4}]
[{"$nulls":19},98,"04:44 PM-New Zealand-8 (G)",{"$f":"IF(Schedule!A99=\"\",\"\",(Schedule!A99))","v":"G"},{"$f":"IF(Schedule!B99=\"\",\"\",TEXT(Schedule!B99,\"HH:MM AM/PM\"))","v":"04:44 PM"},{"$f":"IF(Schedule!C99=\"\",\"\",(Schedule!C99))","v":"New Zealand"},{"$f":"IF(Schedule!D99=\"\",\"\",(Schedule!D99))","v":"ZG"},{"$f":"IF(Schedule!E99=\"\",\"\",(Schedule!E99))","v":8}]
[{"$nulls":19},99,"04:49 PM-Cranbourne-6 (G)",{"$f":"IF(Schedule!A100=\"\",\"\",(Schedule!A100))","v":"G"},{"$f":"IF(Schedule!B100=\"\",\"\",TEXT(Schedule!B100,\"HH:MM AM/PM\"))","v":"04:49 PM"},{"$f":"IF(Schedule!C100=\"\",\"\",(Schedule!C100))","v":"Cranbourne"},{"$f":"IF(Schedule!D100=\"\",\"\",(Schedule!D100))","v":"VG"},{"$f":"IF(Schedule!E100=\"\",\"\",(Schedule!E100))","v":6}]
[{"$nulls":19},100,"04:52 PM-Globe Derby-7 (T)",{"$f":"IF(Schedule!A101=\"\",\"\",(Schedule!A101))","v":"T"},{"$f":"IF(Schedule!B101=\"\",\"\",TEXT(Schedule!B101,\"HH:MM AM/PM\"))","v":"04:52 PM"},{"$f":"IF(Schedule!C101=\"\",\"\",(Schedule!C101))","v":"Globe Derby"},{"$f":"IF(Schedule!D101=\"\",\"\",(Schedule!D101))","v":"AT"},{"$f":"IF(Schedule!E101=\"\",\"\",(Schedule!E101))","v":7}]
[{"$nulls":19},101,"04:57 PM-Bathurst-6 (G)",{"$f":"IF(Schedule!A102=\"\",\"\",(Schedule!A102))","v":"G"},{"$f":"IF(Schedule!B102=\"\",\"\",TEXT(Schedule!B102,\"HH:MM AM/PM\"))","v":"04:57 PM"},{"$f":"IF(Schedule!C102=\"\",\"\",(Schedule!C102))","v":"Bathurst"},{"$f":"IF(Schedule!D102=\"\",\"\",(Schedule!D102))","v":"NG"},{"$f":"IF(Schedule!E102=\"\",\"\",(Schedule!E102))","v":6}]
[{"$nulls":19},102,"05:00 PM-Goulburn-9 (T)",{"$f":"IF(Schedule!A103=\"\",\"\",(Schedule!A103))","v":"T"},{"$f":"IF(Schedule!B103=\"\",\"\",TEXT(Schedule!B103,\"HH:MM AM/PM\"))","v":"05:00 PM"},{"$f":"IF(Schedule!C103=\"\",\"\",(Schedule!C103))","v":"Goulburn"},{"$f":"IF(Schedule!D103=\"\",\"\",(Schedule!D103))","v":"NT"},{"$f":"IF(Schedule!E103=\"\",\"\",(Schedule!E103))","v":9}]
[{"$nulls":19},103,"05:02 PM-New Zealand-9 (G)",{"$f":"IF(Schedule!A104=\"\",\"\",(Schedule!A104))","v":"G"},{"$f":"IF(Schedule!B104=\"\",\"\",TEXT(Schedule!B104,\"HH:MM AM/PM\"))","v":"05:02 PM"},{"$f":"IF(Schedule!C104=\"\",\"\",(Schedule!C104))","v":"New Zealand"},{"$f":"IF(Schedule!D104=\"\",\"\",(Schedule!D104))","v":"ZG"},{"$f":"IF(Schedule!E104=\"\",\"\",(Schedule!E104))","v":9}]
[{"$nulls":19},104,"05:05 PM-Cranbourne-7 (G)",{"$f":"IF(Schedule!A105=\"\",\"\",(Schedule!A105))","v":"G"},{"$f":"IF(Schedule!B105=\"\",\"\",TEXT(Schedule!B105,\"HH:MM AM/PM\"))","v":"05:05 PM"},{"$f":"IF(Schedule!C105=\"\",\"\",(Schedule!C105))","v":"Cranbourne"},{"$f":"IF(Schedule!D105=\"\",\"\",(Schedule!D105))","v":"VG"},{"$f":"IF(Schedule!E105=\"\",\"\",(Schedule!E105))","v":7}]
[{"$nulls":19},105,"05:08 PM-Maryborough-9 (T)",{"$f":"IF(Schedule!A106=\"\",\"\",(Schedule!A106))","v":"T"},{"$f":"IF(Schedule!B106=\"\",\"\",TEXT(Schedule!B106,\"HH:MM AM/PM\"))","v":"05:08 PM"},{"$f":"IF(Schedule!C106=\"\",\"\",(Schedule!C106))","v":"Maryborough"},{"$f":"IF(Schedule!D106=\"\",\"\",(Schedule!D106))","v":"VT"},{"$f":"IF(Schedule!E106=\"\",\"\",(Schedule!E106))","v":9}]
[{"$nulls":19},106,"05:13 PM-Bathurst-7 (G)",{"$f":"IF(Schedule!A107=\"\",\"\",(Schedule!A107))","v":"G"},{"$f":"IF(Schedule!B107=\"\",\"\",TEXT(Schedule!B107,\"HH:MM AM/PM\"))","v":"05:13 PM"},{"$f":"IF(Schedule!C107=\"\",\"\",(Schedule!C107))","v":"Bathurst"},{"$f":"IF(Schedule!D107=\"\",\"\",(Schedule!D107))","v":"NG"},{"$f":"IF(Schedule!E107=\"\",\"\",(Schedule!E107))","v":7}]
[{"$nulls":19},107,"05:16 PM-Pinjarra-5 (T)",{"$f":"IF(Schedule!A108=\"\",\"\",(Schedule!A108))","v":"T"},{"$f":"IF(Schedule!B108=\"\",\"\",TEXT(Schedule!B108,\"HH:MM AM/PM\"))","v":"05:16 PM"},{"$f":"IF(Schedule!C108=\"\",\"\",(Schedule!C108))","v":"Pinjarra"},{"$f":"IF(Schedule!D108=\"\",\"\",(Schedule!D108))","v":"PT"},{"$f":"IF(Schedule!E108=\"\",\"\",(Schedule!E108))","v":5}]
[{"$nulls":19},108,"05:21 PM-New Zealand-10 (G)",{"$f":"IF(Schedule!A109=\"\",\"\",(Schedule!A109))","v":"G"},{"$f":"IF(Schedule!B109=\"\",\"\",TEXT(Schedule!B109,\"HH:MM AM/PM\"))","v":"05:21 PM"},{"$f":"IF(Schedule!C109=\"\",\"\",(Schedule!C109))","v":"New Zealand"},{"$f":"IF(Schedule!D109=\"\",\"\",(Schedule!D109))","v":"ZG"},{"$f":"IF(Schedule!E109=\"\",\"\",(Schedule!E109))","v":10}]
[{"$nulls":19},109,"05:22 PM-Cranbourne-8 (G)",{"$f":"IF(Schedule!A110=\"\",\"\",(Schedule!A110))","v":"G"},{"$f":"IF(Schedule!B110=\"\",\"\",TEXT(Schedule!B110,\"HH:MM AM/PM\"))","v":"05:22 PM"},{"$f":"IF(Schedule!C110=\"\",\"\",(Schedule!C110))","v":"Cranbourne"},{"$f":"IF(Schedule!D110=\"\",\"\",(Schedule!D110))","v":"VG"},{"$f":"IF(Schedule!E110=\"\",\"\",(Schedule!E110))","v":8}]
[{"$nulls":19},110,"05:32 PM-Bathurst-8 (G)",{"$f":"IF(Schedule!A111=\"\",\"\",(Schedule!A111))","v":"G"},{"$f":"IF(Schedule!B111=\"\",\"\",TEXT(Schedule!B111,\"HH:MM AM/PM\"))","v":"05:32 PM"},{"$f":"IF(Schedule!C111=\"\",\"\",(Schedule!C111))","v":"Bathurst"},{"$f":"IF(Schedule!D111=\"\",\"\",(Schedule!D111))","v":"NG"},{"$f":"IF(Schedule!E111=\"\",\"\",(Schedule!E111))","v":8}]
[{"$nulls":19},111,"05:37 PM-Angle Park-1 (G)",{"$f":"IF(Schedule!A112=\"\",\"\",(Schedule!A112))","v":"G"},{"$f":"IF(Schedule!B112=\"\",\"\",TEXT(Schedule!B112,\"HH:MM AM/PM\"))","v":"05:37 PM"},{"$f":"IF(Schedule!C112=\"\",\"\",(Schedule!C112))","v":"Angle Park"},{"$f":"IF(Schedule!D112=\"\",\"\",(Schedule!D112))","v":"AG"},{"$f":"IF(Schedule!E112=\"\",\"\",(Schedule!E112))","v":1}]
[{"$nulls":19},112,"05:41 PM-Pinjarra-6 (T)",{"$f":"IF(Schedule!A113=\"\",\"\",(Schedule!A113))","v":"T"},{"$f":"IF(Schedule!B113=\"\",\"\",TEXT(Schedule!B113,\"HH:MM AM/PM\"))","v":"05:41 PM"},{"$f":"IF(Schedule!C113=\"\",\"\",(Schedule!C113))","v":"Pinjarra"},{"$f":"IF(Schedule!D113=\"\",\"\",(Schedule!D113))","v":"PT"},{"$f":"IF(Schedule!E113=\"\",\"\",(Schedule!E113))","v":6}]
[{"$nulls":19},113,"05:47 PM-Cranbourne-9 (G)",{"$f":"IF(Schedule!A114=\"\",\"\",(Schedule!A114))","v":"G"},{"$f":"IF(Schedule!B114=\"\",\"\",TEXT(Schedule!B114,\"HH:MM AM/PM\"))","v":"05:47 PM"},{"$f":"IF(Schedule!C114=\"\",\"\",(Schedule!C114))","v":"Cranbourne"},{"$f":"IF(Schedule!D114=\"\",\"\",(Schedule!D114))","v":"VG"},{"$f":"IF(Schedule!E114=\"\",\"\",(Schedule!E114))","v":9}]
[{"$nulls":19},114,"05:52 PM-Bathurst-9 (G)",{"$f":"IF(Schedule!A115=\"\",\"\",(Schedule!A115))","v":"G"},{"$f":"IF(Schedule!B115=\"\",\"\",TEXT(Schedule!B115,\"HH:MM AM/PM\"))","v":"05:52 PM"},{"$f":"IF(Schedule!C115=\"\",\"\",(Schedule!C115))","v":"Bathurst"},{"$f":"IF(Schedule!D115=\"\",\"\",(Schedule!D115))","v":"NG"},{"$f":"IF(Schedule!E115=\"\",\"\",(Schedule!E115))","v":9}]
[{"$nulls":19},115,"05:57 PM-Angle Park-2 (G)",{"$f":"IF(Schedule!A116=\"\",\"\",(Schedule!A116))","v":"G"},{"$f":"IF(Schedule!B116=\"\",\"\",TEXT(Schedule!B116,\"HH:MM AM/PM\"))","v":"05:57 PM"},{"$f":"IF(Schedule!C116=\"\",\"\",(Schedule!C116))","v":"Angle Park"},{"$f":"IF(Schedule!D116=\"\",\"\",(Schedule!D116))","v":"AG"},{"$f":"IF(Schedule!E116=\"\",\"\",(Schedule!E116))","v":2}]
[{"$nulls":19},116,"06:02 PM-Cranbourne-10 (G)",{"$f":"IF(Schedule!A117=\"\",\"\",(Schedule!A117))","v":"G"},{"$f":"IF(Schedule!B117=\"\",\"\",TEXT(Schedule!B117,\"HH:MM AM/PM\"))","v":"06:02 PM"},{"$f":"IF(Schedule!C117=\"\",\"\",(Schedule!C117))","v":"Cranbourne"},{"$f":"IF(Schedule!D117=\"\",\"\",(Schedule!D117))","v":"VG"},{"$f":"IF(Schedule!E117=\"\",\"\",(Schedule!E117))","v":10}]
[{"$nulls":19},117,"06:06 PM-Pinjarra-7 (T)",{"$f":"IF(Schedule!A118=\"\",\"\",(Schedule!A118))","v":"T"},{"$f":"IF(Schedule!B118=\"\",\"\",TEXT(Schedule!B118,\"HH:MM AM/PM\"))","v":"06:06 PM"},{"$f":"IF(Schedule!C118=\"\",\"\",(Schedule!C118))","v":"Pinjarra"},{"$f":"IF(Schedule!D118=\"\",\"\",(Schedule!D118))","v":"PT"},{"$f":"IF(Schedule!E118=\"\",\"\",(Schedule!E118))","v":7}]
[{"$nulls":19},118,"06:11 PM-Shepparton-1 (G)",{"$f":"IF(Schedule!A119=\"\",\"\",(Schedule!A119))","v":"G"},{"$f":"IF(Schedule!B119=\"\",\"\",TEXT(Schedule!B119,\"HH:MM AM/PM\"))","v":"06:11 PM"},{"$f":"IF(Schedule!C119=\"\",\"\",(Schedule!C119))","v":"Shepparton"},{"$f":"IF(Schedule!D119=\"\",\"\",(Schedule!D119))","v":"MG"},{"$f":"IF(Schedule!E119=\"\",\"\",(Schedule!E119))","v":1}]
[{"$nulls":19},119,"06:14 PM-Bulli-1 (G)",{"$f":"IF(Schedule!A120=\"\",\"\",(Schedule!A120))","v":"G"},{"$f":"IF(Schedule!B120=\"\",\"\",TEXT(Schedule!B120,\"HH:MM AM/PM\"))","v":"06:14 PM"},{"$f":"IF(Schedule!C120=\"\",\"\",(Schedule!C120))","v":"Bulli"},{"$f":"IF(Schedule!D120=\"\",\"\",(Schedule!D120))","v":"SG"},{"$f":"IF(Schedule!E120=\"\",\"\",(Schedule!E120))","v":1}]
[{"$nulls":19},120,"06:17 PM-Bathurst-10 (G)",{"$f":"IF(Schedule!A121=\"\",\"\",(Schedule!A121))","v":"G"},{"$f":"IF(Schedule!B121=\"\",\"\",TEXT(Schedule!B121,\"HH:MM AM/PM\"))","v":"06:17 PM"},{"$f":"IF(Schedule!C121=\"\",\"\",(Schedule!C121))","v":"Bathurst"},{"$f":"IF(Schedule!D121=\"\",\"\",(Schedule!D121))","v":"NG"},{"$f":"IF(Schedule!E121=\"\",\"\",(Schedule!E121))","v":10}]
[{"$nulls":19},121,"06:20 PM-Angle Park-3 (G)",{"$f":"IF(Schedule!A122=\"\",\"\",(Schedule!A122))","v":"G"},{"$f":"IF(Schedule!B122=\"\",\"\",TEXT(Schedule!B122,\"HH:MM AM/PM\"))","v":"06:20 PM"},{"$f":"IF(Schedule!C122=\"\",\"\",(Schedule!C122))","v":"Angle Park"},{"$f":"IF(Schedule!D122=\"\",\"\",(Schedule!D122))","v":"AG"},{"$f":"IF(Schedule!E122=\"\",\"\",(Schedule!E122))","v":3}]
[{"$nulls":19},122,"06:23 PM-Cranbourne-11 (G)",{"$f":"IF(Schedule!A123=\"\",\"\",(Schedule!A123))","v":"G"},{"$f":"IF(Schedule!B123=\"\",\"\",TEXT(Schedule!B123,\"HH:MM AM/PM\"))","v":"06:23 PM"},{"$f":"IF(Schedule!C123=\"\",\"\",(Schedule!C123))","v":"Cranbourne"},{"$f":"IF(Schedule!D123=\"\",\"\",(Schedule!D123))","v":"VG"},{"$f":"IF(Schedule!E123=\"\",\"\",(Schedule!E123))","v":11}]
[{"$nulls":19},123,"06:27 PM-Shepparton-2 (G)",{"$f":"IF(Schedule!A124=\"\",\"\",(Schedule!A124))","v":"G"},{"$f":"IF(Schedule!B124=\"\",\"\",TEXT(Schedule!B124,\"HH:MM AM/PM\"))","v":"06:27 PM"},{"$f":"IF(Schedule!C124=\"\",\"\",(Schedule!C124))","v":"Shepparton"},{"$f":"IF(Schedule!D124=\"\",\"\",(Schedule!D124))","v":"MG"},{"$f":"IF(Schedule!E124=\"\",\"\",(Schedule!E124))","v":2}]
[{"$nulls":19},124,"06:30 PM-Bulli-2 (G)",{"$f":"IF(Schedule!A125=\"\",\"\",(Schedule!A125))","v":"G"},{"$f":"IF(Schedule!B125=\"\",\"\",TEXT(Schedule!B125,\"HH:MM AM/PM\"))","v":"06:30 PM"},{"$f":"IF(Schedule!C125=\"\",\"\",(Schedule!C125))","v":"Bulli"},{"$f":"IF(Schedule!D125=\"\",\"\",(Schedule!D125))","v":"SG"},{"$f":"IF(Schedule!E125=\"\",\"\",(Schedule!E125))","v":2}]
[{"$nulls":19},125,"06:33 PM-Pinjarra-8 (T)",{"$f":"IF(Schedule!A126=\"\",\"\",(Schedule!A126))","v":"T"},{"$f":"IF(Schedule!B126=\"\",\"\",TEXT(Schedule!B126,\"HH:MM AM/PM\"))","v":"06:33 PM"},{"$f":"IF(Schedule!C126=\"\",\"\",(Schedule!C126))","v":"Pinjarra"},{"$f":"IF(Schedule!D126=\"\",\"\",(Schedule!D126))","v":"PT"},{"$f":"IF(Schedule!E126=\"\",\"\",(Schedule!E126))","v":8}]
[{"$nulls":19},126,"06:38 PM-Angle Park-4 (G)",{"$f":"IF(Schedule!A127=\"\",\"\",(Schedule!A127))","v":"G"},{"$f":"IF(Schedule!B127=\"\",\"\",TEXT(Schedule!B127,\"HH:MM AM/PM\"))","v":"06:38 PM"},{"$f":"IF(Schedule!C127=\"\",\"\",(Schedule!C127))","v":"Angle Park"},{"$f":"IF(Schedule!D127=\"\",\"\",(Schedule!D127))","v":"AG"},{"$f":"IF(Schedule!E127=\"\",\"\",(Schedule!E127))","v":4}]
[{"$nulls":19},127,"06:41 PM-Launceston-1 (G)",{"$f":"IF(Schedule!A128=\"\",\"\",(Schedule!A128))","v":"G"},{"$f":"IF(Schedule!B128=\"\",\"\",TEXT(Schedule!B128,\"HH:MM AM/PM\"))","v":"06:41 PM"},{"$f":"IF(Schedule!C128=\"\",\"\",(Schedule!C128))","v":"Launceston"},{"$f":"IF(Schedule!D128=\"\",\"\",(Schedule!D128))","v":"TG"},{"$f":"IF(Schedule!E128=\"\",\"\",(Schedule!E128))","v":1}]
[{"$nulls":19},128,"06:44 PM-Albion Park-1 (G)",{"$f":"IF(Schedule!A129=\"\",\"\",(Schedule!A129))","v":"G"},{"$f":"IF(Schedule!B129=\"\",\"\",TEXT(Schedule!B129,\"HH:MM AM/PM\"))","v":"06:44 PM"},{"$f":"IF(Schedule!C129=\"\",\"\",(Schedule!C129))","v":"Albion Park"},{"$f":"IF(Schedule!D129=\"\",\"\",(Schedule!D129))","v":"BG"},{"$f":"IF(Schedule!E129=\"\",\"\",(Schedule!E129))","v":1}]
[{"$nulls":19},129,"06:47 PM-Cranbourne-12 (G)",{"$f":"IF(Schedule!A130=\"\",\"\",(Schedule!A130))","v":"G"},{"$f":"IF(Schedule!B130=\"\",\"\",TEXT(Schedule!B130,\"HH:MM AM/PM\"))","v":"06:47 PM"},{"$f":"IF(Schedule!C130=\"\",\"\",(Schedule!C130))","v":"Cranbourne"},{"$f":"IF(Schedule!D130=\"\",\"\",(Schedule!D130))","v":"VG"},{"$f":"IF(Schedule!E130=\"\",\"\",(Schedule!E130))","v":12}]
[{"$nulls":19},130,{"$f":"IF(V131=\"\",\"\",CONCATENATE(TEXT(W131,\"HH:MM AM/PM\"),\"-\",X131,\"-\",Z131,\" (\",V131,\")\"))","v":"06:50 PM-Shepparton-3 (G)"},{"$f":"IF(Schedule!A131=\"\",\"\",(Schedule!A131))","v":"G"},{"$f":"IF(Schedule!B131=\"\",\"\",TEXT(Schedule!B131,\"HH:MM AM/PM\"))","v":"06:50 PM"},{"$f":"IF(Schedule!C131=\"\",\"\",(Schedule!C131))","v":"Shepparton"},{"$f":"IF(Schedule!D131=\"\",\"\",(Schedule!D131))","v":"MG"},{"$f":"IF(Schedule!E131=\"\",\"\",(Schedule!E131))","v":3}]
[{"$nulls":19},131,"06:54 PM-Bulli-3 (G)",{"$f":"IF(Schedule!A132=\"\",\"\",(Schedule!A132))","v":"G"},{"$f":"IF(Schedule!B132=\"\",\"\",TEXT(Schedule!B132,\"HH:MM AM/PM\"))","v":"06:54 PM"},{"$f":"IF(Schedule!C132=\"\",\"\",(Schedule!C132))","v":"Bulli"},{"$f":"IF(Schedule!D132=\"\",\"\",(Schedule!D132))","v":"SG"},{"$f":"IF(Schedule!E132=\"\",\"\",(Schedule!E132))","v":3}]
[{"$nulls":19},132,"06:58 PM-Angle Park-5 (G)",{"$f":"IF(Schedule!A133=\"\",\"\",(Schedule!A133))","v":"G"},{"$f":"IF(Schedule!B133=\"\",\"\",TEXT(Schedule!B133,\"HH:MM AM/PM\"))","v":"06:58 PM"},{"$f":"IF(Schedule!C133=\"\",\"\",(Schedule!C133))","v":"Angle Park"},{"$f":"IF(Schedule!D133=\"\",\"\",(Schedule!D133))","v":"AG"},{"$f":"IF(Schedule!E133=\"\",\"\",(Schedule!E133))","v":5}]
[{"$nulls":19},133,"07:00 PM-Pinjarra-9 (T)",{"$f":"IF(Schedule!A134=\"\",\"\",(Schedule!A134))","v":"T"},{"$f":"IF(Schedule!B134=\"\",\"\",TEXT(Schedule!B134,\"HH:MM AM/PM\"))","v":"07:00 PM"},{"$f":"IF(Schedule!C134=\"\",\"\",(Schedule!C134))","v":"Pinjarra"},{"$f":"IF(Schedule!D134=\"\",\"\",(Schedule!D134))","v":"PT"},{"$f":"IF(Schedule!E134=\"\",\"\",(Schedule!E134))","v":9}]
[{"$nulls":19},134,"07:05 PM-Launceston-2 (G)",{"$f":"IF(Schedule!A135=\"\",\"\",(Schedule!A135))","v":"G"},{"$f":"IF(Schedule!B135=\"\",\"\",TEXT(Schedule!B135,\"HH:MM AM/PM\"))","v":"07:05 PM"},{"$f":"IF(Schedule!C135=\"\",\"\",(Schedule!C135))","v":"Launceston"},{"$f":"IF(Schedule!D135=\"\",\"\",(Schedule!D135))","v":"TG"},{"$f":"IF(Schedule!E135=\"\",\"\",(Schedule!E135))","v":2}]
[{"$nulls":19},135,"07:08 PM-Albion Park-2 (G)",{"$f":"IF(Schedule!A136=\"\",\"\",(Schedule!A136))","v":"G"},{"$f":"IF(Schedule!B136=\"\",\"\",TEXT(Schedule!B136,\"HH:MM AM/PM\"))","v":"07:08 PM"},{"$f":"IF(Schedule!C136=\"\",\"\",(Schedule!C136))","v":"Albion Park"},{"$f":"IF(Schedule!D136=\"\",\"\",(Schedule!D136))","v":"BG"},{"$f":"IF(Schedule!E136=\"\",\"\",(Schedule!E136))","v":2}]
[{"$nulls":19},136,"07:11 PM-Shepparton-4 (G)",{"$f":"IF(Schedule!A137=\"\",\"\",(Schedule!A137))","v":"G"},{"$f":"IF(Schedule!B137=\"\",\"\",TEXT(Schedule!B137,\"HH:MM AM/PM\"))","v":"07:11 PM"},{"$f":"IF(Schedule!C137=\"\",\"\",(Schedule!C137))","v":"Shepparton"},{"$f":"IF(Schedule!D137=\"\",\"\",(Schedule!D137))","v":"MG"},{"$f":"IF(Schedule!E137=\"\",\"\",(Schedule!E137))","v":4}]
[{"$nulls":19},137,"07:14 PM-Bulli-4 (G)",{"$f":"IF(Schedule!A138=\"\",\"\",(Schedule!A138))","v":"G"},{"$f":"IF(Schedule!B138=\"\",\"\",TEXT(Schedule!B138,\"HH:MM AM/PM\"))","v":"07:14 PM"},{"$f":"IF(Schedule!C138=\"\",\"\",(Schedule!C138))","v":"Bulli"},{"$f":"IF(Schedule!D138=\"\",\"\",(Schedule!D138))","v":"SG"},{"$f":"IF(Schedule!E138=\"\",\"\",(Schedule!E138))","v":4}]
[{"$nulls":19},138,"07:17 PM-Mandurah-1 (G)",{"$f":"IF(Schedule!A139=\"\",\"\",(Schedule!A139))","v":"G"},{"$f":"IF(Schedule!B139=\"\",\"\",TEXT(Schedule!B139,\"HH:MM AM/PM\"))","v":"07:17 PM"},{"$f":"IF(Schedule!C139=\"\",\"\",(Schedule!C139))","v":"Mandurah"},{"$f":"IF(Schedule!D139=\"\",\"\",(Schedule!D139))","v":"PG"},{"$f":"IF(Schedule!E139=\"\",\"\",(Schedule!E139))","v":1}]
[{"$nulls":19},139,"07:20 PM-Angle Park-6 (G)",{"$f":"IF(Schedule!A140=\"\",\"\",(Schedule!A140))","v":"G"},{"$f":"IF(Schedule!B140=\"\",\"\",TEXT(Schedule!B140,\"HH:MM AM/PM\"))","v":"07:20 PM"},{"$f":"IF(Schedule!C140=\"\",\"\",(Schedule!C140))","v":"Angle Park"},{"$f":"IF(Schedule!D140=\"\",\"\",(Schedule!D140))","v":"AG"},{"$f":"IF(Schedule!E140=\"\",\"\",(Schedule!E140))","v":6}]
[{"$nulls":19},140,"07:23 PM-Launceston-3 (G)",{"$f":"IF(Schedule!A141=\"\",\"\",(Schedule!A141))","v":"G"},{"$f":"IF(Schedule!B141=\"\",\"\",TEXT(Schedule!B141,\"HH:MM AM/PM\"))","v":"07:23 PM"},{"$f":"IF(Schedule!C141=\"\",\"\",(Schedule!C141))","v":"Launceston"},{"$f":"IF(Schedule!D141=\"\",\"\",(Schedule!D141))","v":"TG"},{"$f":"IF(Schedule!E141=\"\",\"\",(Schedule!E141))","v":3}]
[{"$nulls":19},141,"07:26 PM-Albion Park-3 (G)",{"$f":"IF(Schedule!A142=\"\",\"\",(Schedule!A142))","v":"G"},{"$f":"IF(Schedule!B142=\"\",\"\",TEXT(Schedule!B142,\"HH:MM AM/PM\"))","v":"07:26 PM"},{"$f":"IF(Schedule!C142=\"\",\"\",(Schedule!C142))","v":"Albion Park"},{"$f":"IF(Schedule!D142=\"\",\"\",(Schedule!D142))","v":"BG"},{"$f":"IF(Schedule!E142=\"\",\"\",(Schedule!E142))","v":3}]
[{"$nulls":19},142,"07:29 PM-Shepparton-5 (G)",{"$f":"IF(Schedule!A143=\"\",\"\",(Schedule!A143))","v":"G"},{"$f":"IF(Schedule!B143=\"\",\"\",TEXT(Schedule!B143,\"HH:MM AM/PM\"))","v":"07:29 PM"},{"$f":"IF(Schedule!C143=\"\",\"\",(Schedule!C143))","v":"Shepparton"},{"$f":"IF(Schedule!D143=\"\",\"\",(Schedule!D143))","v":"MG"},{"$f":"IF(Schedule!E143=\"\",\"\",(Schedule!E143))","v":5}]
[{"$nulls":19},143,"07:32 PM-Bulli-5 (G)",{"$f":"IF(Schedule!A144=\"\",\"\",(Schedule!A144))","v":"G"},{"$f":"IF(Schedule!B144=\"\",\"\",TEXT(Schedule!B144,\"HH:MM AM/PM\"))","v":"07:32 PM"},{"$f":"IF(Schedule!C144=\"\",\"\",(Schedule!C144))","v":"Bulli"},{"$f":"IF(Schedule!D144=\"\",\"\",(Schedule!D144))","v":"SG"},{"$f":"IF(Schedule!E144=\"\",\"\",(Schedule!E144))","v":5}]
[{"$nulls":19},144,"07:35 PM-Mandurah-2 (G)",{"$f":"IF(Schedule!A145=\"\",\"\",(Schedule!A145))","v":"G"},{"$f":"IF(Schedule!B145=\"\",\"\",TEXT(Schedule!B145,\"HH:MM AM/PM\"))","v":"07:35 PM"},{"$f":"IF(Schedule!C145=\"\",\"\",(Schedule!C145))","v":"Mandurah"},{"$f":"IF(Schedule!D145=\"\",\"\",(Schedule!D145))","v":"PG"},{"$f":"IF(Schedule!E145=\"\",\"\",(Schedule!E145))","v":2}]
[{"$nulls":19},145,"07:38 PM-Angle Park-7 (G)",{"$f":"IF(Schedule!A146=\"\",\"\",(Schedule!A146))","v":"G"},{"$f":"IF(Schedule!B146=\"\",\"\",TEXT(Schedule!B146,\"HH:MM AM/PM\"))","v":"07:38 PM"},{"$f":"IF(Schedule!C146=\"\",\"\",(Schedule!C146))","v":"Angle Park"},{"$f":"IF(Schedule!D146=\"\",\"\",(Schedule!D146))","v":"AG"},{"$f":"IF(Schedule!E146=\"\",\"\",(Schedule!E146))","v":7}]
[{"$nulls":19},146,"07:42 PM-Launceston-4 (G)",{"$f":"IF(Schedule!A147=\"\",\"\",(Schedule!A147))","v":"G"},{"$f":"IF(Schedule!B147=\"\",\"\",TEXT(Schedule!B147,\"HH:MM AM/PM\"))","v":"07:42 PM"},{"$f":"IF(Schedule!C147=\"\",\"\",(Schedule!C147))","v":"Launceston"},{"$f":"IF(Schedule!D147=\"\",\"\",(Schedule!D147))","v":"TG"},{"$f":"IF(Schedule!E147=\"\",\"\",(Schedule!E147))","v":4}]
[{"$nulls":19},147,"07:46 PM-Albion Park-4 (G)",{"$f":"IF(Schedule!A148=\"\",\"\",(Schedule!A148))","v":"G"},{"$f":"IF(Schedule!B148=\"\",\"\",TEXT(Schedule!B148,\"HH:MM AM/PM\"))","v":"07:46 PM"},{"$f":"IF(Schedule!C148=\"\",\"\",(Schedule!C148))","v":"Albion Park"},{"$f":"IF(Schedule!D148=\"\",\"\",(Schedule!D148))","v":"BG"},{"$f":"IF(Schedule!E148=\"\",\"\",(Schedule!E148))","v":4}]
[{"$nulls":19},148,"07:49 PM-Shepparton-6 (G)",{"$f":"IF(Schedule!A149=\"\",\"\",(Schedule!A149))","v":"G"},{"$f":"IF(Schedule!B149=\"\",\"\",TEXT(Schedule!B149,\"HH:MM AM/PM\"))","v":"07:49 PM"},{"$f":"IF(Schedule!C149=\"\",\"\",(Schedule!C149))","v":"Shepparton"},{"$f":"IF(Schedule!D149=\"\",\"\",(Schedule!D149))","v":"MG"},{"$f":"IF(Schedule!E149=\"\",\"\",(Schedule!E149))","v":6}]
[{"$nulls":19},149,"07:52 PM-Bulli-6 (G)",{"$f":"IF(Schedule!A150=\"\",\"\",(Schedule!A150))","v":"G"},{"$f":"IF(Schedule!B150=\"\",\"\",TEXT(Schedule!B150,\"HH:MM AM/PM\"))","v":"07:52 PM"},{"$f":"IF(Schedule!C150=\"\",\"\",(Schedule!C150))","v":"Bulli"},{"$f":"IF(Schedule!D150=\"\",\"\",(Schedule!D150))","v":"SG"},{"$f":"IF(Schedule!E150=\"\",\"\",(Schedule!E150))","v":6}]
[{"$nulls":19},150,"07:55 PM-Mandurah-3 (G)",{"$f":"IF(Schedule!A151=\"\",\"\",(Schedule!A151))","v":"G"},{"$f":"IF(Schedule!B151=\"\",\"\",TEXT(Schedule!B151,\"HH:MM AM/PM\"))","v":"07:55 PM"},{"$f":"IF(Schedule!C151=\"\",\"\",(Schedule!C151))","v":"Mandurah"},{"$f":"IF(Schedule!D151=\"\",\"\",(Schedule!D151))","v":"PG"},{"$f":"IF(Schedule!E151=\"\",\"\",(Schedule!E151))","v":3}]
[{"$nulls":19},151,"07:58 PM-Angle Park-8 (G)",{"$f":"IF(Schedule!A152=\"\",\"\",(Schedule!A152))","v":"G"},{"$f":"IF(Schedule!B152=\"\",\"\",TEXT(Schedule!B152,\"HH:MM AM/PM\"))","v":"07:58 PM"},{"$f":"IF(Schedule!C152=\"\",\"\",(Schedule!C152))","v":"Angle Park"},{"$f":"IF(Schedule!D152=\"\",\"\",(Schedule!D152))","v":"AG"},{"$f":"IF(Schedule!E152=\"\",\"\",(Schedule!E152))","v":8}]
[{"$nulls":19},152,"08:02 PM-Launceston-5 (G)",{"$f":"IF(Schedule!A153=\"\",\"\",(Schedule!A153))","v":"G"},{"$f":"IF(Schedule!B153=\"\",\"\",TEXT(Schedule!B153,\"HH:MM AM/PM\"))","v":"08:02 PM"},{"$f":"IF(Schedule!C153=\"\",\"\",(Schedule!C153))","v":"Launceston"},{"$f":"IF(Schedule!D153=\"\",\"\",(Schedule!D153))","v":"TG"},{"$f":"IF(Schedule!E153=\"\",\"\",(Schedule!E153))","v":5}]
[{"$nulls":19},153,"08:06 PM-Albion Park-5 (G)",{"$f":"IF(Schedule!A154=\"\",\"\",(Schedule!A154))","v":"G"},{"$f":"IF(Schedule!B154=\"\",\"\",TEXT(Schedule!B154,\"HH:MM AM/PM\"))","v":"08:06 PM"},{"$f":"IF(Schedule!C154=\"\",\"\",(Schedule!C154))","v":"Albion Park"},{"$f":"IF(Schedule!D154=\"\",\"\",(Schedule!D154))","v":"BG"},{"$f":"IF(Schedule!E154=\"\",\"\",(Schedule!E154))","v":5}]
[{"$nulls":19},154,"08:09 PM-Shepparton-7 (G)",{"$f":"IF(Schedule!A155=\"\",\"\",(Schedule!A155))","v":"G"},{"$f":"IF(Schedule!B155=\"\",\"\",TEXT(Schedule!B155,\"HH:MM AM/PM\"))","v":"08:09 PM"},{"$f":"IF(Schedule!C155=\"\",\"\",(Schedule!C155))","v":"Shepparton"},{"$f":"IF(Schedule!D155=\"\",\"\",(Schedule!D155))","v":"MG"},{"$f":"IF(Schedule!E155=\"\",\"\",(Schedule!E155))","v":7}]
[{"$nulls":19},155,"08:12 PM-Bulli-7 (G)",{"$f":"IF(Schedule!A156=\"\",\"\",(Schedule!A156))","v":"G"},{"$f":"IF(Schedule!B156=\"\",\"\",TEXT(Schedule!B156,\"HH:MM AM/PM\"))","v":"08:12 PM"},{"$f":"IF(Schedule!C156=\"\",\"\",(Schedule!C156))","v":"Bulli"},{"$f":"IF(Schedule!D156=\"\",\"\",(Schedule!D156))","v":"SG"},{"$f":"IF(Schedule!E156=\"\",\"\",(Schedule!E156))","v":7}]
[{"$nulls":19},156,"08:15 PM-Mandurah-4 (G)",{"$f":"IF(Schedule!A157=\"\",\"\",(Schedule!A157))","v":"G"},{"$f":"IF(Schedule!B157=\"\",\"\",TEXT(Schedule!B157,\"HH:MM AM/PM\"))","v":"08:15 PM"},{"$f":"IF(Schedule!C157=\"\",\"\",(Schedule!C157))","v":"Mandurah"},{"$f":"IF(Schedule!D157=\"\",\"\",(Schedule!D157))","v":"PG"},{"$f":"IF(Schedule!E157=\"\",\"\",(Schedule!E157))","v":4}]
[{"$nulls":19},157,"08:18 PM-Angle Park-9 (G)",{"$f":"IF(Schedule!A158=\"\",\"\",(Schedule!A158))","v":"G"},{"$f":"IF(Schedule!B158=\"\",\"\",TEXT(Schedule!B158,\"HH:MM AM/PM\"))","v":"08:18 PM"},{"$f":"IF(Schedule!C158=\"\",\"\",(Schedule!C158))","v":"Angle Park"},{"$f":"IF(Schedule!D158=\"\",\"\",(Schedule!D158))","v":"AG"},{"$f":"IF(Schedule!E158=\"\",\"\",(Schedule!E158))","v":9}]
[{"$nulls":19},158,"08:22 PM-Launceston-6 (G)",{"$f":"IF(Schedule!A159=\"\",\"\",(Schedule!A159))","v":"G"},{"$f":"IF(Schedule!B159=\"\",\"\",TEXT(Schedule!B159,\"HH:MM AM/PM\"))","v":"08:22 PM"},{"$f":"IF(Schedule!C159=\"\",\"\",(Schedule!C159))","v":"Launceston"},{"$f":"IF(Schedule!D159=\"\",\"\",(Schedule!D159))","v":"TG"},{"$f":"IF(Schedule!E159=\"\",\"\",(Schedule!E159))","v":6}]
[{"$nulls":19},159,"08:25 PM-Albion Park-6 (G)",{"$f":"IF(Schedule!A160=\"\",\"\",(Schedule!A160))","v":"G"},{"$f":"IF(Schedule!B160=\"\",\"\",TEXT(Schedule!B160,\"HH:MM AM/PM\"))","v":"08:25 PM"},{"$f":"IF(Schedule!C160=\"\",\"\",(Schedule!C160))","v":"Albion Park"},{"$f":"IF(Schedule!D160=\"\",\"\",(Schedule!D160))","v":"BG"},{"$f":"IF(Schedule!E160=\"\",\"\",(Schedule!E160))","v":6}]
[{"$nulls":19},160,"08:28 PM-Shepparton-8 (G)",{"$f":"IF(Schedule!A161=\"\",\"\",(Schedule!A161))","v":"G"},{"$f":"IF(Schedule!B161=\"\",\"\",TEXT(Schedule!B161,\"HH:MM AM/PM\"))","v":"08:28 PM"},{"$f":"IF(Schedule!C161=\"\",\"\",(Schedule!C161))","v":"Shepparton"},{"$f":"IF(Schedule!D161=\"\",\"\",(Schedule!D161))","v":"MG"},{"$f":"IF(Schedule!E161=\"\",\"\",(Schedule!E161))","v":8}]
[{"$nulls":19},161,"08:32 PM-Bulli-8 (G)",{"$f":"IF(Schedule!A162=\"\",\"\",(Schedule!A162))","v":"G"},{"$f":"IF(Schedule!B162=\"\",\"\",TEXT(Schedule!B162,\"HH:MM AM/PM\"))","v":"08:32 PM"},{"$f":"IF(Schedule!C162=\"\",\"\",(Schedule!C162))","v":"Bulli"},{"$f":"IF(Schedule!D162=\"\",\"\",(Schedule!D162))","v":"SG"},{"$f":"IF(Schedule!E162=\"\",\"\",(Schedule!E162))","v":8}]
[{"$nulls":19},162,"08:35 PM-Mandurah-5 (G)",{"$f":"IF(Schedule!A163=\"\",\"\",(Schedule!A163))","v":"G"},{"$f":"IF(Schedule!B163=\"\",\"\",TEXT(Schedule!B163,\"HH:MM AM/PM\"))","v":"08:35 PM"},{"$f":"IF(Schedule!C163=\"\",\"\",(Schedule!C163))","v":"Mandurah"},{"$f":"IF(Schedule!D163=\"\",\"\",(Schedule!D163))","v":"PG"},{"$f":"IF(Schedule!E163=\"\",\"\",(Schedule!E163))","v":5}]
[{"$nulls":19},163,"08:38 PM-Angle Park-10 (G)",{"$f":"IF(Schedule!A164=\"\",\"\",(Schedule!A164))","v":"G"},{"$f":"IF(Schedule!B164=\"\",\"\",TEXT(Schedule!B164,\"HH:MM AM/PM\"))","v":"08:38 PM"},{"$f":"IF(Schedule!C164=\"\",\"\",(Schedule!C164))","v":"Angle Park"},{"$f":"IF(Schedule!D164=\"\",\"\",(Schedule!D164))","v":"AG"},{"$f":"IF(Schedule!E164=\"\",\"\",(Schedule!E164))","v":10}]
[{"$nulls":19},164,"08:42 PM-Launceston-7 (G)",{"$f":"IF(Schedule!A165=\"\",\"\",(Schedule!A165))","v":"G"},{"$f":"IF(Schedule!B165=\"\",\"\",TEXT(Schedule!B165,\"HH:MM AM/PM\"))","v":"08:42 PM"},{"$f":"IF(Schedule!C165=\"\",\"\",(Schedule!C165))","v":"Launceston"},{"$f":"IF(Schedule!D165=\"\",\"\",(Schedule!D165))","v":"TG"},{"$f":"IF(Schedule!E165=\"\",\"\",(Schedule!E165))","v":7}]
[{"$nulls":19},165,"08:45 PM-Albion Park-7 (G)",{"$f":"IF(Schedule!A166=\"\",\"\",(Schedule!A166))","v":"G"},{"$f":"IF(Schedule!B166=\"\",\"\",TEXT(Schedule!B166,\"HH:MM AM/PM\"))","v":"08:45 PM"},{"$f":"IF(Schedule!C166=\"\",\"\",(Schedule!C166))","v":"Albion Park"},{"$f":"IF(Schedule!D166=\"\",\"\",(Schedule!D166))","v":"BG"},{"$f":"IF(Schedule!E166=\"\",\"\",(Schedule!E166))","v":7}]
[{"$nulls":19},166,"08:48 PM-Shepparton-9 (G)",{"$f":"IF(Schedule!A167=\"\",\"\",(Schedule!A167))","v":"G"},{"$f":"IF(Schedule!B167=\"\",\"\",TEXT(Schedule!B167,\"HH:MM AM/PM\"))","v":"08:48 PM"},{"$f":"IF(Schedule!C167=\"\",\"\",(Schedule!C167))","v":"Shepparton"},{"$f":"IF(Schedule!D167=\"\",\"\",(Schedule!D167))","v":"MG"},{"$f":"IF(Schedule!E167=\"\",\"\",(Schedule!E167))","v":9}]
[{"$nulls":19},167,"08:52 PM-Bulli-9 (G)",{"$f":"IF(Schedule!A168=\"\",\"\",(Schedule!A168))","v":"G"},{"$f":"IF(Schedule!B168=\"\",\"\",TEXT(Schedule!B168,\"HH:MM AM/PM\"))","v":"08:52 PM"},{"$f":"IF(Schedule!C168=\"\",\"\",(Schedule!C168))","v":"Bulli"},{"$f":"IF(Schedule!D168=\"\",\"\",(Schedule!D168))","v":"SG"},{"$f":"IF(Schedule!E168=\"\",\"\",(Schedule!E168))","v":9}]
[{"$nulls":19},168,"08:55 PM-Mandurah-6 (G)",{"$f":"IF(Schedule!A169=\"\",\"\",(Schedule!A169))","v":"G"},{"$f":"IF(Schedule!B169=\"\",\"\",TEXT(Schedule!B169,\"HH:MM AM/PM\"))","v":"08:55 PM"},{"$f":"IF(Schedule!C169=\"\",\"\",(Schedule!C169))","v":"Mandurah"},{"$f":"IF(Schedule!D169=\"\",\"\",(Schedule!D169))","v":"PG"},{"$f":"IF(Schedule!E169=\"\",\"\",(Schedule!E169))","v":6}]
[{"$nulls":19},169,"08:58 PM-Angle Park-11 (G)",{"$f":"IF(Schedule!A170=\"\",\"\",(Schedule!A170))","v":"G"},{"$f":"IF(Schedule!B170=\"\",\"\",TEXT(Schedule!B170,\"HH:MM AM/PM\"))","v":"08:58 PM"},{"$f":"IF(Schedule!C170=\"\",\"\",(Schedule!C170))","v":"Angle Park"},{"$f":"IF(Schedule!D170=\"\",\"\",(Schedule!D170))","v":"AG"},{"$f":"IF(Schedule!E170=\"\",\"\",(Schedule!E170))","v":11}]
[{"$nulls":19},170,"09:02 PM-Launceston-8 (G)",{"$f":"IF(Schedule!A171=\"\",\"\",(Schedule!A171))","v":"G"},{"$f":"IF(Schedule!B171=\"\",\"\",TEXT(Schedule!B171,\"HH:MM AM/PM\"))","v":"09:02 PM"},{"$f":"IF(Schedule!C171=\"\",\"\",(Schedule!C171))","v":"Launceston"},{"$f":"IF(Schedule!D171=\"\",\"\",(Schedule!D171))","v":"TG"},{"$f":"IF(Schedule!E171=\"\",\"\",(Schedule!E171))","v":8}]
[{"$nulls":19},171,"09:05 PM-Albion Park-8 (G)",{"$f":"IF(Schedule!A172=\"\",\"\",(Schedule!A172))","v":"G"},{"$f":"IF(Schedule!B172=\"\",\"\",TEXT(Schedule!B172,\"HH:MM AM/PM\"))","v":"09:05 PM"},{"$f":"IF(Schedule!C172=\"\",\"\",(Schedule!C172))","v":"Albion Park"},{"$f":"IF(Schedule!D172=\"\",\"\",(Schedule!D172))","v":"BG"},{"$f":"IF(Schedule!E172=\"\",\"\",(Schedule!E172))","v":8}]
[{"$nulls":19},172,"09:08 PM-Shepparton-10 (G)",{"$f":"IF(Schedule!A173=\"\",\"\",(Schedule!A173))","v":"G"},{"$f":"IF(Schedule!B173=\"\",\"\",TEXT(Schedule!B173,\"HH:MM AM/PM\"))","v":"09:08 PM"},{"$f":"IF(Schedule!C173=\"\",\"\",(Schedule!C173))","v":"Shepparton"},{"$f":"IF(Schedule!D173=\"\",\"\",(Schedule!D173))","v":"MG"},{"$f":"IF(Schedule!E173=\"\",\"\",(Schedule!E173))","v":10}]
[{"$nulls":19},173,"09:12 PM-Bulli-10 (G)",{"$f":"IF(Schedule!A174=\"\",\"\",(Schedule!A174))","v":"G"},{"$f":"IF(Schedule!B174=\"\",\"\",TEXT(Schedule!B174,\"HH:MM AM/PM\"))","v":"09:12 PM"},{"$f":"IF(Schedule!C174=\"\",\"\",(Schedule!C174))","v":"Bulli"},{"$f":"IF(Schedule!D174=\"\",\"\",(Schedule!D174))","v":"SG"},{"$f":"IF(Schedule!E174=\"\",\"\",(Schedule!E174))","v":10}]
[{"$nulls":19},174,"09:15 PM-Mandurah-7 (G)",{"$f":"IF(Schedule!A175=\"\",\"\",(Schedule!A175))","v":"G"},{"$f":"IF(Schedule!B175=\"\",\"\",TEXT(Schedule!B175,\"HH:MM AM/PM\"))","v":"09:15 PM"},{"$f":"IF(Schedule!C175=\"\",\"\",(Schedule!C175))","v":"Mandurah"},{"$f":"IF(Schedule!D175=\"\",\"\",(Schedule!D175))","v":"PG"},{"$f":"IF(Schedule!E175=\"\",\"\",(Schedule!E175))","v":7}]
[{"$nulls":19},175,"09:20 PM-Launceston-9 (G)",{"$f":"IF(Schedule!A176=\"\",\"\",(Schedule!A176))","v":"G"},{"$f":"IF(Schedule!B176=\"\",\"\",TEXT(Schedule!B176,\"HH:MM AM/PM\"))","v":"09:20 PM"},{"$f":"IF(Schedule!C176=\"\",\"\",(Schedule!C176))","v":"Launceston"},{"$f":"IF(Schedule!D176=\"\",\"\",(Schedule!D176))","v":"TG"},{"$f":"IF(Schedule!E176=\"\",\"\",(Schedule!E176))","v":9}]
[{"$nulls":19},176,"09:25 PM-Albion Park-9 (G)",{"$f":"IF(Schedule!A177=\"\",\"\",(Schedule!A177))","v":"G"},{"$f":"IF(Schedule!B177=\"\",\"\",TEXT(Schedule!B177,\"HH:MM AM/PM\"))","v":"09:25 PM"},{"$f":"IF(Schedule!C177=\"\",\"\",(Schedule!C177))","v":"Albion Park"},{"$f":"IF(Schedule!D177=\"\",\"\",(Schedule!D177))","v":"BG"},{"$f":"IF(Schedule!E177=\"\",\"\",(Schedule!E177))","v":9}]
[{"$nulls":19},177,"09:30 PM-Shepparton-11 (G)",{"$f":"IF(Schedule!A178=\"\",\"\",(Schedule!A178))","v":"G"},{"$f":"IF(Schedule!B178=\"\",\"\",TEXT(Schedule!B178,\"HH:MM AM/PM\"))","v":"09:30 PM"},{"$f":"IF(Schedule!C178=\"\",\"\",(Schedule!C178))","v":"Shepparton"},{"$f":"IF(Schedule!D178=\"\",\"\",(Schedule!D178))","v":"MG"},{"$f":"IF(Schedule!E178=\"\",\"\",(Schedule!E178))","v":11}]
[{"$nulls":19},178,"09:35 PM-Mandurah-8 (G)",{"$f":"IF(Schedule!A179=\"\",\"\",(Schedule!A179))","v":"G"},{"$f":"IF(Schedule!B179=\"\",\"\",TEXT(Schedule!B179,\"HH:MM AM/PM\"))","v":"09:35 PM"},{"$f":"IF(Schedule!C179=\"\",\"\",(Schedule!C179))","v":"Mandurah"},{"$f":"IF(Schedule!D179=\"\",\"\",(Schedule!D179))","v":"PG"},{"$f":"IF(Schedule!E179=\"\",\"\",(Schedule!E179))","v":8}]
[{"$nulls":19},179,"09:40 PM-Launceston-10 (G)",{"$f":"IF(Schedule!A180=\"\",\"\",(Schedule!A180))","v":"G"},{"$f":"IF(Schedule!B180=\"\",\"\",TEXT(Schedule!B180,\"HH:MM AM/PM\"))","v":"09:40 PM"},{"$f":"IF(Schedule!C180=\"\",\"\",(Schedule!C180))","v":"Launceston"},{"$f":"IF(Schedule!D180=\"\",\"\",(Schedule!D180))","v":"TG"},{"$f":"IF(Schedule!E180=\"\",\"\",(Schedule!E180))","v":10}]
[{"$nulls":19},180,"09:44 PM-Albion Park-10 (G)",{"$f":"IF(Schedule!A181=\"\",\"\",(Schedule!A181))","v":"G"},{"$f":"IF(Schedule!B181=\"\",\"\",TEXT(Schedule!B181,\"HH:MM AM/PM\"))","v":"09:44 PM"},{"$f":"IF(Schedule!C181=\"\",\"\",(Schedule!C181))","v":"Albion Park"},{"$f":"IF(Schedule!D181=\"\",\"\",(Schedule!D181))","v":"BG"},{"$f":"IF(Schedule!E181=\"\",\"\",(Schedule!E181))","v":10}]
[{"$nulls":19},181,"09:48 PM-Shepparton-12 (G)",{"$f":"IF(Schedule!A182=\"\",\"\",(Schedule!A182))","v":"G"},{"$f":"IF(Schedule!B182=\"\",\"\",TEXT(Schedule!B182,\"HH:MM AM/PM\"))","v":"09:48 PM"},{"$f":"IF(Schedule!C182=\"\",\"\",(Schedule!C182))","v":"Shepparton"},{"$f":"IF(Schedule!D182=\"\",\"\",(Schedule!D182))","v":"MG"},{"$f":"IF(Schedule!E182=\"\",\"\",(Schedule!E182))","v":12}]
[{"$nulls":19},182,"09:52 PM-Mandurah-9 (G)",{"$f":"IF(Schedule!A183=\"\",\"\",(Schedule!A183))","v":"G"},{"$f":"IF(Schedule!B183=\"\",\"\",TEXT(Schedule!B183,\"HH:MM AM/PM\"))","v":"09:52 PM"},{"$f":"IF(Schedule!C183=\"\",\"\",(Schedule!C183))","v":"Mandurah"},{"$f":"IF(Schedule!D183=\"\",\"\",(Schedule!D183))","v":"PG"},{"$f":"IF(Schedule!E183=\"\",\"\",(Schedule!E183))","v":9}]
[{"$nulls":19},183,"10:07 PM-Mandurah-10 (G)",{"$f":"IF(Schedule!A184=\"\",\"\",(Schedule!A184))","v":"G"},{"$f":"IF(Schedule!B184=\"\",\"\",TEXT(Schedule!B184,\"HH:MM AM/PM\"))","v":"10:07 PM"},{"$f":"IF(Schedule!C184=\"\",\"\",(Schedule!C184))","v":"Mandurah"},{"$f":"IF(Schedule!D184=\"\",\"\",(Schedule!D184))","v":"PG"},{"$f":"IF(Schedule!E184=\"\",\"\",(Schedule!E184))","v":10}]
[{"$nulls":19},184,"10:24 PM-Mandurah-11 (G)",{"$f":"IF(Schedule!A185=\"\",\"\",(Schedule!A185))","v":"G"},{"$f":"IF(Schedule!B185=\"\",\"\",TEXT(Schedule!B185,\"HH:MM AM/PM\"))","v":"10:24 PM"},{"$f":"IF(Schedule!C185=\"\",\"\",(Schedule!C185))","v":"Mandurah"},{"$f":"IF(Schedule!D185=\"\",\"\",(Schedule!D185))","v":"PG"},{"$f":"IF(Schedule!E185=\"\",\"\",(Schedule!E185))","v":11}]
[{"$nulls":19},185,"10:40 PM-Mandurah-12 (G)",{"$f":"IF(Schedule!A186=\"\",\"\",(Schedule!A186))","v":"G"},{"$f":"IF(Schedule!B186=\"\",\"\",TEXT(Schedule!B186,\"HH:MM AM/PM\"))","v":"10:40 PM"},{"$f":"IF(Schedule!C186=\"\",\"\",(Schedule!C186))","v":"Mandurah"},{"$f":"IF(Schedule!D186=\"\",\"\",(Schedule!D186))","v":"PG"},{"$f":"IF(Schedule!E186=\"\",\"\",(Schedule!E186))","v":12}]
[{"$nulls":19},186,"",{"$f":"IF(Schedule!A199=\"\",\"\",(Schedule!A199))","v":""},{"$f":"IF(Schedule!B199=\"\",\"\",TEXT(Schedule!B199,\"HH:MM AM/PM\"))","v":""},{"$f":"IF(Schedule!C199=\"\",\"\",(Schedule!C199))","v":""},{"$f":"IF(Schedule!D199=\"\",\"\",(Schedule!D199))","v":""},{"$f":"IF(Schedule!E199=\"\",\"\",(Schedule!E199))","v":""}]
[{"$nulls":19},187,"",{"$f":"IF(Schedule!A200=\"\",\"\",(Schedule!A200))","v":""},{"$f":"IF(Schedule!B200=\"\",\"\",TEXT(Schedule!B200,\"HH:MM AM/PM\"))","v":""},{"$f":"IF(Schedule!C200=\"\",\"\",(Schedule!C200))","v":""},{"$f":"IF(Schedule!D200=\"\",\"\",(Schedule!D200))","v":""},{"$f":"IF(Schedule!E200=\"\",\"\",(Schedule!E200))","v":""}]
[{"$nulls":19},188,"",{"$f":"IF(Schedule!A201=\"\",\"\",(Schedule!A201))","v":""},{"$f":"IF(Schedule!B201=\"\",\"\",TEXT(Schedule!B201,\"HH:MM AM/PM\"))","v":""},{"$f":"IF(Schedule!C201=\"\",\"\",(Schedule!C201))","v":""},{"$f":"IF(Schedule!D201=\"\",\"\",(Schedule!D201))","v":""},{"$f":"IF(Schedule!E201=\"\",\"\",(Schedule!E201))","v":""}]
[{"$nulls":19},189,"",{"$f":"IF(Schedule!A202=\"\",\"\",(Schedule!A202))","v":""},{"$f":"IF(Schedule!B202=\"\",\"\",TEXT(Schedule!B202,\"HH:MM AM/PM\"))","v":""},{"$f":"IF(Schedule!C202=\"\",\"\",(Schedule!C202))","v":""},{"$f":"IF(Schedule!D202=\"\",\"\",(Schedule!D202))","v":""},{"$f":"IF(Schedule!E202=\"\",\"\",(Schedule!E202))","v":""}]
[{"$nulls":19},190,"",{"$f":"IF(Schedule!A203=\"\",\"\",(Schedule!A203))","v":""},{"$f":"IF(Schedule!B203=\"\",\"\",TEXT(Schedule!B203,\"HH:MM AM/PM\"))","v":""},{"$f":"IF(Schedule!C203=\"\",\"\",(Schedule!C203))","v":""},{"$f":"IF(Schedule!D203=\"\",\"\",(Schedule!D203))","v":""},{"$f":"IF(Schedule!E203=\"\",\"\",(Schedule!E203))","v":""}]
[{"$nulls":19},191,"",{"$f":"IF(Schedule!A204=\"\",\"\",(Schedule!A204))","v":""},{"$f":"IF(Schedule!B204=\"\",\"\",TEXT(Schedule!B204,\"HH:MM AM/PM\"))","v":""},{"$f":"IF(Schedule!C204=\"\",\"\",(Schedule!C204))","v":""},{"$f":"IF(Schedule!D204=\"\",\"\",(Schedule!D204))","v":""},{"$f":"IF(Schedule!E204=\"\",\"\",(Schedule!E204))","v":""}]
[{"$nulls":19},192,"",{"$f":"IF(Schedule!A205=\"\",\"\",(Schedule!A205))","v":""},{"$f":"IF(Schedule!B205=\"\",\"\",TEXT(Schedule!B205,\"HH:MM AM/PM\"))","v":""},{"$f":"IF(Schedule!C205=\"\",\"\",(Schedule!C205))","v":""},{"$f":"IF(Schedule!D205=\"\",\"\",(Schedule!D205))","v":""},{"$f":"IF(Schedule!E205=\"\",\"\",(Schedule!E205))","v":""}]
[{"$nulls":19},193,"",{"$f":"IF(Schedule!A206=\"\",\"\",(Schedule!A206))","v":""},{"$f":"IF(Schedule!B206=\"\",\"\",TEXT(Schedule!B206,\"HH:MM AM/PM\"))","v":""},{"$f":"IF(Schedule!C206=\"\",\"\",(Schedule!C206))","v":""},{"$f":"IF(Schedule!D206=\"\",\"\",(Schedule!D206))","v":""},{"$f":"IF(Schedule!E206=\"\",\"\",(Schedule!E206))","v":""}]
[{"$nulls":19},194,{"$f":"IF(V195=\"\",\"\",CONCATENATE(TEXT(W195,\"HH:MM AM/PM\"),\"-\",X195,\"-\",Z195,\" (\",V195,\")\"))","v":""},{"$f":"IF(Schedule!A207=\"\",\"\",(Schedule!A207))","v":""},{"$f":"IF(Schedule!B207=\"\",\"\",TEXT(Schedule!B207,\"HH:MM AM/PM\"))","v":""},{"$f":"IF(Schedule!C207=\"\",\"\",(Schedule!C207))","v":""},{"$f":"IF(Schedule!D207=\"\",\"\",(Schedule!D207))","v":""},{"$f":"IF(Schedule!E207=\"\",\"\",(Schedule!E207))","v":""}]
[{"$nulls":19},195,"",{"$f":"IF(Schedule!A208=\"\",\"\",(Schedule!A208))","v":""},{"$f":"IF(Schedule!B208=\"\",\"\",TEXT(Schedule!B208,\"HH:MM AM/PM\"))","v":""},{"$f":"IF(Schedule!C208=\"\",\"\",(Schedule!C208))","v":""},{"$f":"IF(Schedule!D208=\"\",\"\",(Schedule!D208))","v":""},{"$f":"IF(Schedule!E208=\"\",\"\",(Schedule!E208))","v":""}]
[{"$nulls":19},196,"",{"$f":"IF(Schedule!A209=\"\",\"\",(Schedule!A209))","v":""},{"$f":"IF(Schedule!B209=\"\",\"\",TEXT(Schedule!B209,\"HH:MM AM/PM\"))","v":""},{"$f":"IF(Schedule!C209=\"\",\"\",(Schedule!C209))","v":""},{"$f":"IF(Schedule!D209=\"\",\"\",(Schedule!D209))","v":""},{"$f":"IF(Schedule!E209=\"\",\"\",(Schedule!E209))","v":""}]
[{"$nulls":19},197,"",{"$f":"IF(Schedule!A210=\"\",\"\",(Schedule!A210))","v":""},{"$f":"IF(Schedule!B210=\"\",\"\",TEXT(Schedule!B210,\"HH:MM AM/PM\"))","v":""},{"$f":"IF(Schedule!C210=\"\",\"\",(Schedule!C210))","v":""},{"$f":"IF(Schedule!D210=\"\",\"\",(Schedule!D210))","v":""},{"$f":"IF(Schedule!E210=\"\",\"\",(Schedule!E210))","v":""}]
[{"$nulls":19},198,"",{"$f":"IF(Schedule!A211=\"\",\"\",(Schedule!A211))","v":""},{"$f":"IF(Schedule!B211=\"\",\"\",TEXT(Schedule!B211,\"HH:MM AM/PM\"))","v":""},{"$f":"IF(Schedule!C211=\"\",\"\",(Schedule!C211))","v":""},{"$f":"IF(Schedule!D211=\"\",\"\",(Schedule!D211))","v":""},{"$f":"IF(Schedule!E211=\"\",\"\",(Schedule!E211))","v":""}]
[{"$nulls":19},199,"",{"$f":"IF(Schedule!A212=\"\",\"\",(Schedule!A212))","v":""},{"$f":"IF(Schedule!B212=\"\",\"\",TEXT(Schedule!B212,\"HH:MM AM/PM\"))","v":""},{"$f":"IF(Schedule!C212=\"\",\"\",(Schedule!C212))","v":""},{"$f":"IF(Schedule!D212=\"\",\"\",(Schedule!D212))","v":""},{"$f":"IF(Schedule!E212=\"\",\"\",(Schedule!E212))","v":""}]
[{"$nulls":19},200,"",{"$f":"IF(Schedule!A213=\"\",\"\",(Schedule!A213))","v":""},{"$f":"IF(Schedule!B213=\"\",\"\",TEXT(Schedule!B213,\"HH:MM AM/PM\"))","v":""},{"$f":"IF(Schedule!C213=\"\",\"\",(Schedule!C213))","v":""},{"$f":"IF(Schedule!D213=\"\",\"\",(Schedule!D213))","v":""},{"$f":"IF(Schedule!E213=\"\",\"\",(Schedule!E213))","v":""}]
[{"$nulls":19},201,"",{"$f":"IF(Schedule!A214=\"\",\"\",(Schedule!A214))","v":""},{"$f":"IF(Schedule!B214=\"\",\"\",TEXT(Schedule!B214,\"HH:MM AM/PM\"))","v":""},{"$f":"IF(Schedule!C214=\"\",\"\",(Schedule!C214))","v":""},{"$f":"IF(Schedule!D214=\"\",\"\",(Schedule!D214))","v":""},{"$f":"IF(Schedule!E214=\"\",\"\",(Schedule!E214))","v":""}]
[{"$nulls":19},202,"",{"$f":"IF(Schedule!A215=\"\",\"\",(Schedule!A215))","v":""},{"$f":"IF(Schedule!B215=\"\",\"\",TEXT(Schedule!B215,\"HH:MM AM/PM\"))","v":""},{"$f":"IF(Schedule!C215=\"\",\"\",(Schedule!C215))","v":""},{"$f":"IF(Schedule!D215=\"\",\"\",(Schedule!D215))","v":""},{"$f":"IF(Schedule!E215=\"\",\"\",(Schedule!E215))","v":""}]
[{"$nulls":19},203,"",{"$f":"IF(Schedule!A216=\"\",\"\",(Schedule!A216))","v":""},{"$f":"IF(Schedule!B216=\"\",\"\",TEXT(Schedule!B216,\"HH:MM AM/PM\"))","v":""},{"$f":"IF(Schedule!C216=\"\",\"\",(Schedule!C216))","v":""},{"$f":"IF(Schedule!D216=\"\",\"\",(Schedule!D216))","v":""},{"$f":"IF(Schedule!E216=\"\",\"\",(Schedule!E216))","v":""}]
[{"$nulls":19},204,"",{"$f":"IF(Schedule!A217=\"\",\"\",(Schedule!A217))","v":""},{"$f":"IF(Schedule!B217=\"\",\"\",TEXT(Schedule!B217,\"HH:MM AM/PM\"))","v":""},{"$f":"IF(Schedule!C217=\"\",\"\",(Schedule!C217))","v":""},{"$f":"IF(Schedule!D217=\"\",\"\",(Schedule!D217))","v":""},{"$f":"IF(Schedule!E217=\"\",\"\",(Schedule!E217))","v":""}]
[{"$nulls":19},205,"",{"$f":"IF(Schedule!A218=\"\",\"\",(Schedule!A218))","v":""},{"$f":"IF(Schedule!B218=\"\",\"\",TEXT(Schedule!B218,\"HH:MM AM/PM\"))","v":""},{"$f":"IF(Schedule!C218=\"\",\"\",(Schedule!C218))","v":""},{"$f":"IF(Schedule!D218=\"\",\"\",(Schedule!D218))","v":""},{"$f":"IF(Schedule!E218=\"\",\"\",(Schedule!E218))","v":""}]
[{"$nulls":19},206,"",{"$f":"IF(Schedule!A219=\"\",\"\",(Schedule!A219))","v":""},{"$f":"IF(Schedule!B219=\"\",\"\",TEXT(Schedule!B219,\"HH:MM AM/PM\"))","v":""},{"$f":"IF(Schedule!C219=\"\",\"\",(Schedule!C219))","v":""},{"$f":"IF(Schedule!D219=\"\",\"\",(Schedule!D219))","v":""},{"$f":"IF(Schedule!E219=\"\",\"\",(Schedule!E219))","v":""}]
[{"$nulls":19},207,"",{"$f":"IF(Schedule!A220=\"\",\"\",(Schedule!A220))","v":""},{"$f":"IF(Schedule!B220=\"\",\"\",TEXT(Schedule!B220,\"HH:MM AM/PM\"))","v":""},{"$f":"IF(Schedule!C220=\"\",\"\",(Schedule!C220))","v":""},{"$f":"IF(Schedule!D220=\"\",\"\",(Schedule!D220))","v":""},{"$f":"IF(Schedule!E220=\"\",\"\",(Schedule!E220))","v":""}]
[{"$nulls":19},208,"",{"$f":"IF(Schedule!A221=\"\",\"\",(Schedule!A221))","v":""},{"$f":"IF(Schedule!B221=\"\",\"\",TEXT(Schedule!B221,\"HH:MM AM/PM\"))","v":""},{"$f":"IF(Schedule!C221=\"\",\"\",(Schedule!C221))","v":""},{"$f":"IF(Schedule!D221=\"\",\"\",(Schedule!D221))","v":""},{"$f":"IF(Schedule!E221=\"\",\"\",(Schedule!E221))","v":""}]
[{"$nulls":19},209,"",{"$f":"IF(Schedule!A222=\"\",\"\",(Schedule!A222))","v":""},{"$f":"IF(Schedule!B222=\"\",\"\",TEXT(Schedule!B222,\"HH:MM AM/PM\"))","v":""},{"$f":"IF(Schedule!C222=\"\",\"\",(Schedule!C222))","v":""},{"$f":"IF(Schedule!D222=\"\",\"\",(Schedule!D222))","v":""},{"$f":"IF(Schedule!E222=\"\",\"\",(Schedule!E222))","v":""}]
[{"$nulls":19},210,"",{"$f":"IF(Schedule!A223=\"\",\"\",(Schedule!A223))","v":""},{"$f":"IF(Schedule!B223=\"\",\"\",TEXT(Schedule!B223,\"HH:MM AM/PM\"))","v":""},{"$f":"IF(Schedule!C223=\"\",\"\",(Schedule!C223))","v":""},{"$f":"IF(Schedule!D223=\"\",\"\",(Schedule!D223))","v":""},{"$f":"IF(Schedule!E223=\"\",\"\",(Schedule!E223))","v":""}]
[{"$nulls":19},211,"",{"$f":"IF(Schedule!A224=\"\",\"\",(Schedule!A224))","v":""},{"$f":"IF(Schedule!B224=\"\",\"\",TEXT(Schedule!B224,\"HH:MM AM/PM\"))","v":""},{"$f":"IF(Schedule!C224=\"\",\"\",(Schedule!C224))","v":""},{"$f":"IF(Schedule!D224=\"\",\"\",(Schedule!D224))","v":""},{"$f":"IF(Schedule!E224=\"\",\"\",(Schedule!E224))","v":""}]
[{"$nulls":19},212,"",{"$f":"IF(Schedule!A225=\"\",\"\",(Schedule!A225))","v":""},{"$f":"IF(Schedule!B225=\"\",\"\",TEXT(Schedule!B225,\"HH:MM AM/PM\"))","v":""},{"$f":"IF(Schedule!C225=\"\",\"\",(Schedule!C225))","v":""},{"$f":"IF(Schedule!D225=\"\",\"\",(Schedule!D225))","v":""},{"$f":"IF(Schedule!E225=\"\",\"\",(Schedule!E225))","v":""}]
[{"$nulls":19},213,"",{"$f":"IF(Schedule!A226=\"\",\"\",(Schedule!A226))","v":""},{"$f":"IF(Schedule!B226=\"\",\"\",TEXT(Schedule!B226,\"HH:MM AM/PM\"))","v":""},{"$f":"IF(Schedule!C226=\"\",\"\",(Schedule!C226))","v":""},{"$f":"IF(Schedule!D226=\"\",\"\",(Schedule!D226))","v":""},{"$f":"IF(Schedule!E226=\"\",\"\",(Schedule!E226))","v":""}]
[{"$nulls":19},214,"",{"$f":"IF(Schedule!A227=\"\",\"\",(Schedule!A227))","v":""},{"$f":"IF(Schedule!B227=\"\",\"\",TEXT(Schedule!B227,\"HH:MM AM/PM\"))","v":""},{"$f":"IF(Schedule!C227=\"\",\"\",(Schedule!C227))","v":""},{"$f":"IF(Schedule!D227=\"\",\"\",(Schedule!D227))","v":""},{"$f":"IF(Schedule!E227=\"\",\"\",(Schedule!E227))","v":""}]
[{"$nulls":19},215,"",{"$f":"IF(Schedule!A228=\"\",\"\",(Schedule!A228))","v":""},{"$f":"IF(Schedule!B228=\"\",\"\",TEXT(Schedule!B228,\"HH:MM AM/PM\"))","v":""},{"$f":"IF(Schedule!C228=\"\",\"\",(Schedule!C228))","v":""},{"$f":"IF(Schedule!D228=\"\",\"\",(Schedule!D228))","v":""},{"$f":"IF(Schedule!E228=\"\",\"\",(Schedule!E228))","v":""}]
[{"$nulls":19},216,"",{"$f":"IF(Schedule!A229=\"\",\"\",(Schedule!A229))","v":""},{"$f":"IF(Schedule!B229=\"\",\"\",TEXT(Schedule!B229,\"HH:MM AM/PM\"))","v":""},{"$f":"IF(Schedule!C229=\"\",\"\",(Schedule!C229))","v":""},{"$f":"IF(Schedule!D229=\"\",\"\",(Schedule!D229))","v":""},{"$f":"IF(Schedule!E229=\"\",\"\",(Schedule!E229))","v":""}]
[{"$nulls":19},217,"",{"$f":"IF(Schedule!A230=\"\",\"\",(Schedule!A230))","v":""},{"$f":"IF(Schedule!B230=\"\",\"\",TEXT(Schedule!B230,\"HH:MM AM/PM\"))","v":""},{"$f":"IF(Schedule!C230=\"\",\"\",(Schedule!C230))","v":""},{"$f":"IF(Schedule!D230=\"\",\"\",(Schedule!D230))","v":""},{"$f":"IF(Schedule!E230=\"\",\"\",(Schedule!E230))","v":""}]
[{"$nulls":19},218,"",{"$f":"IF(Schedule!A231=\"\",\"\",(Schedule!A231))","v":""},{"$f":"IF(Schedule!B231=\"\",\"\",TEXT(Schedule!B231,\"HH:MM AM/PM\"))","v":""},{"$f":"IF(Schedule!C231=\"\",\"\",(Schedule!C231))","v":""},{"$f":"IF(Schedule!D231=\"\",\"\",(Schedule!D231))","v":""},{"$f":"IF(Schedule!E231=\"\",\"\",(Schedule!E231))","v":""}]
[{"$nulls":19},219,"",{"$f":"IF(Schedule!A232=\"\",\"\",(Schedule!A232))","v":""},{"$f":"IF(Schedule!B232=\"\",\"\",TEXT(Schedule!B232,\"HH:MM AM/PM\"))","v":""},{"$f":"IF(Schedule!C232=\"\",\"\",(Schedule!C232))","v":""},{"$f":"IF(Schedule!D232=\"\",\"\",(Schedule!D232))","v":""},{"$f":"IF(Schedule!E232=\"\",\"\",(Schedule!E232))","v":""}]
[{"$nulls":19},220,"",{"$f":"IF(Schedule!A233=\"\",\"\",(Schedule!A233))","v":""},{"$f":"IF(Schedule!B233=\"\",\"\",TEXT(Schedule!B233,\"HH:MM AM/PM\"))","v":""},{"$f":"IF(Schedule!C233=\"\",\"\",(Schedule!C233))","v":""},{"$f":"IF(Schedule!D233=\"\",\"\",(Schedule!D233))","v":""},{"$f":"IF(Schedule!E233=\"\",\"\",(Schedule!E233))","v":""}]
[{"$nulls":19},221,"",{"$f":"IF(Schedule!A234=\"\",\"\",(Schedule!A234))","v":""},{"$f":"IF(Schedule!B234=\"\",\"\",TEXT(Schedule!B234,\"HH:MM AM/PM\"))","v":""},{"$f":"IF(Schedule!C234=\"\",\"\",(Schedule!C234))","v":""},{"$f":"IF(Schedule!D234=\"\",\"\",(Schedule!D234))","v":""},{"$f":"IF(Schedule!E234=\"\",\"\",(Schedule!E234))","v":""}]
[{"$nulls":19},222,"",{"$f":"IF(Schedule!A235=\"\",\"\",(Schedule!A235))","v":""},{"$f":"IF(Schedule!B235=\"\",\"\",TEXT(Schedule!B235,\"HH:MM AM/PM\"))","v":""},{"$f":"IF(Schedule!C235=\"\",\"\",(Schedule!C235))","v":""},{"$f":"IF(Schedule!D235=\"\",\"\",(Schedule!D235))","v":""},{"$f":"IF(Schedule!E235=\"\",\"\",(Schedule!E235))","v":""}]
[{"$nulls":19},223,"",{"$f":"IF(Schedule!A236=\"\",\"\",(Schedule!A236))","v":""},{"$f":"IF(Schedule!B236=\"\",\"\",TEXT(Schedule!B236,\"HH:MM AM/PM\"))","v":""},{"$f":"IF(Schedule!C236=\"\",\"\",(Schedule!C236))","v":""},{"$f":"IF(Schedule!D236=\"\",\"\",(Schedule!D236))","v":""},{"$f":"IF(Schedule!E236=\"\",\"\",(Schedule!E236))","v":""}]
[{"$nulls":19},224,"",{"$f":"IF(Schedule!A237=\"\",\"\",(Schedule!A237))","v":""},{"$f":"IF(Schedule!B237=\"\",\"\",TEXT(Schedule!B237,\"HH:MM AM/PM\"))","v":""},{"$f":"IF(Schedule!C237=\"\",\"\",(Schedule!C237))","v":""},{"$f":"IF(Schedule!D237=\"\",\"\",(Schedule!D237))","v":""},{"$f":"IF(Schedule!E237=\"\",\"\",(Schedule!E237))","v":""}]
[{"$nulls":19},225,"",{"$f":"IF(Schedule!A238=\"\",\"\",(Schedule!A238))","v":""},{"$f":"IF(Schedule!B238=\"\",\"\",TEXT(Schedule!B238,\"HH:MM AM/PM\"))","v":""},{"$f":"IF(Schedule!C238=\"\",\"\",(Schedule!C238))","v":""},{"$f":"IF(Schedule!D238=\"\",\"\",(Schedule!D238))","v":""},{"$f":"IF(Schedule!E238=\"\",\"\",(Schedule!E238))","v":""}]
[{"$nulls":19},226,"",{"$f":"IF(Schedule!A239=\"\",\"\",(Schedule!A239))","v":""},{"$f":"IF(Schedule!B239=\"\",\"\",TEXT(Schedule!B239,\"HH:MM AM/PM\"))","v":""},{"$f":"IF(Schedule!C239=\"\",\"\",(Schedule!C239))","v":""},{"$f":"IF(Schedule!D239=\"\",\"\",(Schedule!D239))","v":""},{"$f":"IF(Schedule!E239=\"\",\"\",(Schedule!E239))","v":""}]
[{"$nulls":19},227,"",{"$f":"IF(Schedule!A240=\"\",\"\",(Schedule!A240))","v":""},{"$f":"IF(Schedule!B240=\"\",\"\",TEXT(Schedule!B240,\"HH:MM AM/PM\"))","v":""},{"$f":"IF(Schedule!C240=\"\",\"\",(Schedule!C240))","v":""},{"$f":"IF(Schedule!D240=\"\",\"\",(Schedule!D240))","v":""},{"$f":"IF(Schedule!E240=\"\",\"\",(Schedule!E240))","v":""}]
[{"$nulls":19},228,"",{"$f":"IF(Schedule!A241=\"\",\"\",(Schedule!A241))","v":""},{"$f":"IF(Schedule!B241=\"\",\"\",TEXT(Schedule!B241,\"HH:MM AM/PM\"))","v":""},{"$f":"IF(Schedule!C241=\"\",\"\",(Schedule!C241))","v":""},{"$f":"IF(Schedule!D241=\"\",\"\",(Schedule!D241))","v":""},{"$f":"IF(Schedule!E241=\"\",\"\",(Schedule!E241))","v":""}]
[{"$nulls":19},229,"",{"$f":"IF(Schedule!A242=\"\",\"\",(Schedule!A242))","v":""},{"$f":"IF(Schedule!B242=\"\",\"\",TEXT(Schedule!B242,\"HH:MM AM/PM\"))","v":""},{"$f":"IF(Schedule!C242=\"\",\"\",(Schedule!C242))","v":""},{"$f":"IF(Schedule!D242=\"\",\"\",(Schedule!D242))","v":""},{"$f":"IF(Schedule!E242=\"\",\"\",(Schedule!E242))","v":""}]
[{"$nulls":19},230,"",{"$f":"IF(Schedule!A243=\"\",\"\",(Schedule!A243))","v":""},{"$f":"IF(Schedule!B243=\"\",\"\",TEXT(Schedule!B243,\"HH:MM AM/PM\"))","v":""},{"$f":"IF(Schedule!C243=\"\",\"\",(Schedule!C243))","v":""},{"$f":"IF(Schedule!D243=\"\",\"\",(Schedule!D243))","v":""},{"$f":"IF(Schedule!E243=\"\",\"\",(Schedule!E243))","v":""}]
[{"$nulls":19},231,"",{"$f":"IF(Schedule!A244=\"\",\"\",(Schedule!A244))","v":""},{"$f":"IF(Schedule!B244=\"\",\"\",TEXT(Schedule!B244,\"HH:MM AM/PM\"))","v":""},{"$f":"IF(Schedule!C244=\"\",\"\",(Schedule!C244))","v":""},{"$f":"IF(Schedule!D244=\"\",\"\",(Schedule!D244))","v":""},{"$f":"IF(Schedule!E244=\"\",\"\",(Schedule!E244))","v":""}]
[{"$nulls":19},232,"",{"$f":"IF(Schedule!A245=\"\",\"\",(Schedule!A245))","v":""},{"$f":"IF(Schedule!B245=\"\",\"\",TEXT(Schedule!B245,\"HH:MM AM/PM\"))","v":""},{"$f":"IF(Schedule!C245=\"\",\"\",(Schedule!C245))","v":""},{"$f":"IF(Schedule!D245=\"\",\"\",(Schedule!D245))","v":""},{"$f":"IF(Schedule!E245=\"\",\"\",(Schedule!E245))","v":""}]
[{"$nulls":19},233,"",{"$f":"IF(Schedule!A246=\"\",\"\",(Schedule!A246))","v":""},{"$f":"IF(Schedule!B246=\"\",\"\",TEXT(Schedule!B246,\"HH:MM AM/PM\"))","v":""},{"$f":"IF(Schedule!C246=\"\",\"\",(Schedule!C246))","v":""},{"$f":"IF(Schedule!D246=\"\",\"\",(Schedule!D246))","v":""},{"$f":"IF(Schedule!E246=\"\",\"\",(Schedule!E246))","v":""}]
[{"$nulls":19},234,"",{"$f":"IF(Schedule!A247=\"\",\"\",(Schedule!A247))","v":""},{"$f":"IF(Schedule!B247=\"\",\"\",TEXT(Schedule!B247,\"HH:MM AM/PM\"))","v":""},{"$f":"IF(Schedule!C247=\"\",\"\",(Schedule!C247))","v":""},{"$f":"IF(Schedule!D247=\"\",\"\",(Schedule!D247))","v":""},{"$f":"IF(Schedule!E247=\"\",\"\",(Schedule!E247))","v":""}]
[{"$nulls":19},235,"",{"$f":"IF(Schedule!A248=\"\",\"\",(Schedule!A248))","v":""},{"$f":"IF(Schedule!B248=\"\",\"\",TEXT(Schedule!B248,\"HH:MM AM/PM\"))","v":""},{"$f":"IF(Schedule!C248=\"\",\"\",(Schedule!C248))","v":""},{"$f":"IF(Schedule!D248=\"\",\"\",(Schedule!D248))","v":""},{"$f":"IF(Schedule!E248=\"\",\"\",(Schedule!E248))","v":""}]
[{"$nulls":19},236,"",{"$f":"IF(Schedule!A249=\"\",\"\",(Schedule!A249))","v":""},{"$f":"IF(Schedule!B249=\"\",\"\",TEXT(Schedule!B249,\"HH:MM AM/PM\"))","v":""},{"$f":"IF(Schedule!C249=\"\",\"\",(Schedule!C249))","v":""},{"$f":"IF(Schedule!D249=\"\",\"\",(Schedule!D249))","v":""},{"$f":"IF(Schedule!E249=\"\",\"\",(Schedule!E249))","v":""}]
[{"$nulls":19},237,"",{"$f":"IF(Schedule!A250=\"\",\"\",(Schedule!A250))","v":""},{"$f":"IF(Schedule!B250=\"\",\"\",TEXT(Schedule!B250,\"HH:MM AM/PM\"))","v":""},{"$f":"IF(Schedule!C250=\"\",\"\",(Schedule!C250))","v":""},{"$f":"IF(Schedule!D250=\"\",\"\",(Schedule!D250))","v":""},{"$f":"IF(Schedule!E250=\"\",\"\",(Schedule!E250))","v":""}]
[{"$nulls":19},238,"",{"$f":"IF(Schedule!A251=\"\",\"\",(Schedule!A251))","v":""},{"$f":"IF(Schedule!B251=\"\",\"\",TEXT(Schedule!B251,\"HH:MM AM/PM\"))","v":""},{"$f":"IF(Schedule!C251=\"\",\"\",(Schedule!C251))","v":""},{"$f":"IF(Schedule!D251=\"\",\"\",(Schedule!D251))","v":""},{"$f":"IF(Schedule!E251=\"\",\"\",(Schedule!E251))","v":""}]
[{"$nulls":19},239,"",{"$f":"IF(Schedule!A252=\"\",\"\",(Schedule!A252))","v":""},{"$f":"IF(Schedule!B252=\"\",\"\",TEXT(Schedule!B252,\"HH:MM AM/PM\"))","v":""},{"$f":"IF(Schedule!C252=\"\",\"\",(Schedule!C252))","v":""},{"$f":"IF(Schedule!D252=\"\",\"\",(Schedule!D252))","v":""},{"$f":"IF(Schedule!E252=\"\",\"\",(Schedule!E252))","v":""}]
[{"$nulls":19},240,"",{"$f":"IF(Schedule!A253=\"\",\"\",(Schedule!A253))","v":""},{"$f":"IF(Schedule!B253=\"\",\"\",TEXT(Schedule!B253,\"HH:MM AM/PM\"))","v":""},{"$f":"IF(Schedule!C253=\"\",\"\",(Schedule!C253))","v":""},{"$f":"IF(Schedule!D253=\"\",\"\",(Schedule!D253))","v":""},{"$f":"IF(Schedule!E253=\"\",\"\",(Schedule!E253))","v":""}]
[{"$nulls":19},241,"",{"$f":"IF(Schedule!A254=\"\",\"\",(Schedule!A254))","v":""},{"$f":"IF(Schedule!B254=\"\",\"\",TEXT(Schedule!B254,\"HH:MM AM/PM\"))","v":""},{"$f":"IF(Schedule!C254=\"\",\"\",(Schedule!C254))","v":""},{"$f":"IF(Schedule!D254=\"\",\"\",(Schedule!D254))","v":""},{"$f":"IF(Schedule!E254=\"\",\"\",(Schedule!E254))","v":""}]
[{"$nulls":19},242,"",{"$f":"IF(Schedule!A255=\"\",\"\",(Schedule!A255))","v":""},{"$f":"IF(Schedule!B255=\"\",\"\",TEXT(Schedule!B255,\"HH:MM AM/PM\"))","v":""},{"$f":"IF(Schedule!C255=\"\",\"\",(Schedule!C255))","v":""},{"$f":"IF(Schedule!D255=\"\",\"\",(Schedule!D255))","v":""},{"$f":"IF(Schedule!E255=\"\",\"\",(Schedule!E255))","v":""}]
[{"$nulls":19},243,"",{"$f":"IF(Schedule!A256=\"\",\"\",(Schedule!A256))","v":""},{"$f":"IF(Schedule!B256=\"\",\"\",TEXT(Schedule!B256,\"HH:MM AM/PM\"))","v":""},{"$f":"IF(Schedule!C256=\"\",\"\",(Schedule!C256))","v":""},{"$f":"IF(Schedule!D256=\"\",\"\",(Schedule!D256))","v":""},{"$f":"IF(Schedule!E256=\"\",\"\",(Schedule!E256))","v":""}]
[{"$nulls":19},244,"",{"$f":"IF(Schedule!A257=\"\",\"\",(Schedule!A257))","v":""},{"$f":"IF(Schedule!B257=\"\",\"\",TEXT(Schedule!B257,\"HH:MM AM/PM\"))","v":""},{"$f":"IF(Schedule!C257=\"\",\"\",(Schedule!C257))","v":""},{"$f":"IF(Schedule!D257=\"\",\"\",(Schedule!D257))","v":""},{"$f":"IF(Schedule!E257=\"\",\"\",(Schedule!E257))","v":""}]
[{"$nulls":19},245,"",{"$f":"IF(Schedule!A258=\"\",\"\",(Schedule!A258))","v":""},{"$f":"IF(Schedule!B258=\"\",\"\",TEXT(Schedule!B258,\"HH:MM AM/PM\"))","v":""},{"$f":"IF(Schedule!C258=\"\",\"\",(Schedule!C258))","v":""},{"$f":"IF(Schedule!D258=\"\",\"\",(Schedule!D258))","v":""},{"$f":"IF(Schedule!E258=\"\",\"\",(Schedule!E258))","v":""}]
[{"$nulls":19},246,"",{"$f":"IF(Schedule!A259=\"\",\"\",(Schedule!A259))","v":""},{"$f":"IF(Schedule!B259=\"\",\"\",TEXT(Schedule!B259,\"HH:MM AM/PM\"))","v":""},{"$f":"IF(Schedule!C259=\"\",\"\",(Schedule!C259))","v":""},{"$f":"IF(Schedule!D259=\"\",\"\",(Schedule!D259))","v":""},{"$f":"IF(Schedule!E259=\"\",\"\",(Schedule!E259))","v":""}]
[{"$nulls":19},247,"",{"$f":"IF(Schedule!A260=\"\",\"\",(Schedule!A260))","v":""},{"$f":"IF(Schedule!B260=\"\",\"\",TEXT(Schedule!B260,\"HH:MM AM/PM\"))","v":""},{"$f":"IF(Schedule!C260=\"\",\"\",(Schedule!C260))","v":""},{"$f":"IF(Schedule!D260=\"\",\"\",(Schedule!D260))","v":""},{"$f":"IF(Schedule!E260=\"\",\"\",(Schedule!E260))","v":""}]
[{"$nulls":19},248,"",{"$f":"IF(Schedule!A261=\"\",\"\",(Schedule!A261))","v":""},{"$f":"IF(Schedule!B261=\"\",\"\",TEXT(Schedule!B261,\"HH:MM AM/PM\"))","v":""},{"$f":"IF(Schedule!C261=\"\",\"\",(Schedule!C261))","v":""},{"$f":"IF(Schedule!D261=\"\",\"\",(Schedule!D261))","v":""},{"$f":"IF(Schedule!E261=\"\",\"\",(Schedule!E261))","v":""}]
[{"$nulls":19},249,"",{"$f":"IF(Schedule!A262=\"\",\"\",(Schedule!A262))","v":""},{"$f":"IF(Schedule!B262=\"\",\"\",TEXT(Schedule!B262,\"HH:MM AM/PM\"))","v":""},{"$f":"IF(Schedule!C262=\"\",\"\",(Schedule!C262))","v":""},{"$f":"IF(Schedule!D262=\"\",\"\",(Schedule!D262))","v":""},{"$f":"IF(Schedule!E262=\"\",\"\",(Schedule!E262))","v":""}]
[{"$nulls":19},250,"",{"$f":"IF(Schedule!A263=\"\",\"\",(Schedule!A263))","v":""},{"$f":"IF(Schedule!B263=\"\",\"\",TEXT(Schedule!B263,\"HH:MM AM/PM\"))","v":""},{"$f":"IF(Schedule!C263=\"\",\"\",(Schedule!C263))","v":""},{"$f":"IF(Schedule!D263=\"\",\"\",(Schedule!D263))","v":""},{"$f":"IF(Schedule!E263=\"\",\"\",(Schedule!E263))","v":""}]
[{"$nulls":19},251,"",{"$f":"IF(Schedule!A264=\"\",\"\",(Schedule!A264))","v":""},{"$f":"IF(Schedule!B264=\"\",\"\",TEXT(Schedule!B264,\"HH:MM AM/PM\"))","v":""},{"$f":"IF(Schedule!C264=\"\",\"\",(Schedule!C264))","v":""},{"$f":"IF(Schedule!D264=\"\",\"\",(Schedule!D264))","v":""},{"$f":"IF(Schedule!E264=\"\",\"\",(Schedule!E264))","v":""}]
[{"$nulls":19},252,"",{"$f":"IF(Schedule!A265=\"\",\"\",(Schedule!A265))","v":""},{"$f":"IF(Schedule!B265=\"\",\"\",TEXT(Schedule!B265,\"HH:MM AM/PM\"))","v":""},{"$f":"IF(Schedule!C265=\"\",\"\",(Schedule!C265))","v":""},{"$f":"IF(Schedule!D265=\"\",\"\",(Schedule!D265))","v":""},{"$f":"IF(Schedule!E265=\"\",\"\",(Schedule!E265))","v":""}]
[{"$nulls":19},253,"",{"$f":"IF(Schedule!A266=\"\",\"\",(Schedule!A266))","v":""},{"$f":"IF(Schedule!B266=\"\",\"\",TEXT(Schedule!B266,\"HH:MM AM/PM\"))","v":""},{"$f":"IF(Schedule!C266=\"\",\"\",(Schedule!C266))","v":""},{"$f":"IF(Schedule!D266=\"\",\"\",(Schedule!D266))","v":""},{"$f":"IF(Schedule!E266=\"\",\"\",(Schedule!E266))","v":""}]
[{"$nulls":19},254,"",{"$f":"IF(Schedule!A267=\"\",\"\",(Schedule!A267))","v":""},{"$f":"IF(Schedule!B267=\"\",\"\",TEXT(Schedule!B267,\"HH:MM AM/PM\"))","v":""},{"$f":"IF(Schedule!C267=\"\",\"\",(Schedule!C267))","v":""},{"$f":"IF(Schedule!D267=\"\",\"\",(Schedule!D267))","v":""},{"$f":"IF(Schedule!E267=\"\",\"\",(Schedule!E267))","v":""}]
[{"$nulls":19},255,"",{"$f":"IF(Schedule!A268=\"\",\"\",(Schedule!A268))","v":""},{"$f":"IF(Schedule!B268=\"\",\"\",TEXT(Schedule!B268,\"HH:MM AM/PM\"))","v":""},{"$f":"IF(Schedule!C268=\"\",\"\",(Schedule!C268))","v":""},{"$f":"IF(Schedule!D268=\"\",\"\",(Schedule!D268))","v":""},{"$f":"IF(Schedule!E268=\"\",\"\",(Schedule!E268))","v":""}]
[{"$nulls":19},256,"",{"$f":"IF(Schedule!A269=\"\",\"\",(Schedule!A269))","v":""},{"$f":"IF(Schedule!B269=\"\",\"\",TEXT(Schedule!B269,\"HH:MM AM/PM\"))","v":""},{"$f":"IF(Schedule!C269=\"\",\"\",(Schedule!C269))","v":""},{"$f":"IF(Schedule!D269=\"\",\"\",(Schedule!D269))","v":""},{"$f":"IF(Schedule!E269=\"\",\"\",(Schedule!E269))","v":""}]
[{"$nulls":19},257,"",{"$f":"IF(Schedule!A270=\"\",\"\",(Schedule!A270))","v":""},{"$f":"IF(Schedule!B270=\"\",\"\",TEXT(Schedule!B270,\"HH:MM AM/PM\"))","v":""},{"$f":"IF(Schedule!C270=\"\",\"\",(Schedule!C270))","v":""},{"$f":"IF(Schedule!D270=\"\",\"\",(Schedule!D270))","v":""},{"$f":"IF(Schedule!E270=\"\",\"\",(Schedule!E270))","v":""}]
[{"$nulls":19},258,{"$f":"IF(V259=\"\",\"\",CONCATENATE(TEXT(W259,\"HH:MM AM/PM\"),\"-\",X259,\"-\",Z259,\" (\",V259,\")\"))","v":""},{"$f":"IF(Schedule!A271=\"\",\"\",(Schedule!A271))","v":""},{"$f":"IF(Schedule!B271=\"\",\"\",TEXT(Schedule!B271,\"HH:MM AM/PM\"))","v":""},{"$f":"IF(Schedule!C271=\"\",\"\",(Schedule!C271))","v":""},{"$f":"IF(Schedule!D271=\"\",\"\",(Schedule!D271))","v":""},{"$f":"IF(Schedule!E271=\"\",\"\",(Schedule!E271))","v":""}]
[{"$nulls":19},259,"",{"$f":"IF(Schedule!A272=\"\",\"\",(Schedule!A272))","v":""},{"$f":"IF(Schedule!B272=\"\",\"\",TEXT(Schedule!B272,\"HH:MM AM/PM\"))","v":""},{"$f":"IF(Schedule!C272=\"\",\"\",(Schedule!C272))","v":""},{"$f":"IF(Schedule!D272=\"\",\"\",(Schedule!D272))","v":""},{"$f":"IF(Schedule!E272=\"\",\"\",(Schedule!E272))","v":""}]
[{"$nulls":19},260,"",{"$f":"IF(Schedule!A273=\"\",\"\",(Schedule!A273))","v":""},{"$f":"IF(Schedule!B273=\"\",\"\",TEXT(Schedule!B273,\"HH:MM AM/PM\"))","v":""},{"$f":"IF(Schedule!C273=\"\",\"\",(Schedule!C273))","v":""},{"$f":"IF(Schedule!D273=\"\",\"\",(Schedule!D273))","v":""},{"$f":"IF(Schedule!E273=\"\",\"\",(Schedule!E273))","v":""}]
[{"$nulls":19},261,"",{"$f":"IF(Schedule!A274=\"\",\"\",(Schedule!A274))","v":""},{"$f":"IF(Schedule!B274=\"\",\"\",TEXT(Schedule!B274,\"HH:MM AM/PM\"))","v":""},{"$f":"IF(Schedule!C274=\"\",\"\",(Schedule!C274))","v":""},{"$f":"IF(Schedule!D274=\"\",\"\",(Schedule!D274))","v":""},{"$f":"IF(Schedule!E274=\"\",\"\",(Schedule!E274))","v":""}]
[{"$nulls":19},262,"",{"$f":"IF(Schedule!A275=\"\",\"\",(Schedule!A275))","v":""},{"$f":"IF(Schedule!B275=\"\",\"\",TEXT(Schedule!B275,\"HH:MM AM/PM\"))","v":""},{"$f":"IF(Schedule!C275=\"\",\"\",(Schedule!C275))","v":""},{"$f":"IF(Schedule!D275=\"\",\"\",(Schedule!D275))","v":""},{"$f":"IF(Schedule!E275=\"\",\"\",(Schedule!E275))","v":""}]
[{"$nulls":19},263,"",{"$f":"IF(Schedule!A276=\"\",\"\",(Schedule!A276))","v":""},{"$f":"IF(Schedule!B276=\"\",\"\",TEXT(Schedule!B276,\"HH:MM AM/PM\"))","v":""},{"$f":"IF(Schedule!C276=\"\",\"\",(Schedule!C276))","v":""},{"$f":"IF(Schedule!D276=\"\",\"\",(Schedule!D276))","v":""},{"$f":"IF(Schedule!E276=\"\",\"\",(Schedule!E276))","v":""}]
[{"$nulls":19},264,"",{"$f":"IF(Schedule!A277=\"\",\"\",(Schedule!A277))","v":""},{"$f":"IF(Schedule!B277=\"\",\"\",TEXT(Schedule!B277,\"HH:MM AM/PM\"))","v":""},{"$f":"IF(Schedule!C277=\"\",\"\",(Schedule!C277))","v":""},{"$f":"IF(Schedule!D277=\"\",\"\",(Schedule!D277))","v":""},{"$f":"IF(Schedule!E277=\"\",\"\",(Schedule!E277))","v":""}]
[{"$nulls":19},265,"",{"$f":"IF(Schedule!A278=\"\",\"\",(Schedule!A278))","v":""},{"$f":"IF(Schedule!B278=\"\",\"\",TEXT(Schedule!B278,\"HH:MM AM/PM\"))","v":""},{"$f":"IF(Schedule!C278=\"\",\"\",(Schedule!C278))","v":""},{"$f":"IF(Schedule!D278=\"\",\"\",(Schedule!D278))","v":""},{"$f":"IF(Schedule!E278=\"\",\"\",(Schedule!E278))","v":""}]
[{"$nulls":19},266,"",{"$f":"IF(Schedule!A279=\"\",\"\",(Schedule!A279))","v":""},{"$f":"IF(Schedule!B279=\"\",\"\",TEXT(Schedule!B279,\"HH:MM AM/PM\"))","v":""},{"$f":"IF(Schedule!C279=\"\",\"\",(Schedule!C279))","v":""},{"$f":"IF(Schedule!D279=\"\",\"\",(Schedule!D279))","v":""},{"$f":"IF(Schedule!E279=\"\",\"\",(Schedule!E279))","v":""}]
[{"$nulls":19},267,"",{"$f":"IF(Schedule!A280=\"\",\"\",(Schedule!A280))","v":""},{"$f":"IF(Schedule!B280=\"\",\"\",TEXT(Schedule!B280,\"HH:MM AM/PM\"))","v":""},{"$f":"IF(Schedule!C280=\"\",\"\",(Schedule!C280))","v":""},{"$f":"IF(Schedule!D280=\"\",\"\",(Schedule!D280))","v":""},{"$f":"IF(Schedule!E280=\"\",\"\",(Schedule!E280))","v":""}]
[{"$nulls":19},268,"",{"$f":"IF(Schedule!A281=\"\",\"\",(Schedule!A281))","v":""},{"$f":"IF(Schedule!B281=\"\",\"\",TEXT(Schedule!B281,\"HH:MM AM/PM\"))","v":""},{"$f":"IF(Schedule!C281=\"\",\"\",(Schedule!C281))","v":""},{"$f":"IF(Schedule!D281=\"\",\"\",(Schedule!D281))","v":""},{"$f":"IF(Schedule!E281=\"\",\"\",(Schedule!E281))","v":""}]
[{"$nulls":19},269,"",{"$f":"IF(Schedule!A282=\"\",\"\",(Schedule!A282))","v":""},{"$f":"IF(Schedule!B282=\"\",\"\",TEXT(Schedule!B282,\"HH:MM AM/PM\"))","v":""},{"$f":"IF(Schedule!C282=\"\",\"\",(Schedule!C282))","v":""},{"$f":"IF(Schedule!D282=\"\",\"\",(Schedule!D282))","v":""},{"$f":"IF(Schedule!E282=\"\",\"\",(Schedule!E282))","v":""}]
[{"$nulls":19},270,"",{"$f":"IF(Schedule!A283=\"\",\"\",(Schedule!A283))","v":""},{"$f":"IF(Schedule!B283=\"\",\"\",TEXT(Schedule!B283,\"HH:MM AM/PM\"))","v":""},{"$f":"IF(Schedule!C283=\"\",\"\",(Schedule!C283))","v":""},{"$f":"IF(Schedule!D283=\"\",\"\",(Schedule!D283))","v":""},{"$f":"IF(Schedule!E283=\"\",\"\",(Schedule!E283))","v":""}]
[{"$nulls":19},271,"",{"$f":"IF(Schedule!A284=\"\",\"\",(Schedule!A284))","v":""},{"$f":"IF(Schedule!B284=\"\",\"\",TEXT(Schedule!B284,\"HH:MM AM/PM\"))","v":""},{"$f":"IF(Schedule!C284=\"\",\"\",(Schedule!C284))","v":""},{"$f":"IF(Schedule!D284=\"\",\"\",(Schedule!D284))","v":""},{"$f":"IF(Schedule!E284=\"\",\"\",(Schedule!E284))","v":""}]
[{"$nulls":19},272,"",{"$f":"IF(Schedule!A285=\"\",\"\",(Schedule!A285))","v":""},{"$f":"IF(Schedule!B285=\"\",\"\",TEXT(Schedule!B285,\"HH:MM AM/PM\"))","v":""},{"$f":"IF(Schedule!C285=\"\",\"\",(Schedule!C285))","v":""},{"$f":"IF(Schedule!D285=\"\",\"\",(Schedule!D285))","v":""},{"$f":"IF(Schedule!E285=\"\",\"\",(Schedule!E285))","v":""}]
[{"$nulls":19},273,"",{"$f":"IF(Schedule!A286=\"\",\"\",(Schedule!A286))","v":""},{"$f":"IF(Schedule!B286=\"\",\"\",TEXT(Schedule!B286,\"HH:MM AM/PM\"))","v":""},{"$f":"IF(Schedule!C286=\"\",\"\",(Schedule!C286))","v":""},{"$f":"IF(Schedule!D286=\"\",\"\",(Schedule!D286))","v":""},{"$f":"IF(Schedule!E286=\"\",\"\",(Schedule!E286))","v":""}]
[{"$nulls":19},274,"",{"$f":"IF(Schedule!A287=\"\",\"\",(Schedule!A287))","v":""},{"$f":"IF(Schedule!B287=\"\",\"\",TEXT(Schedule!B287,\"HH:MM AM/PM\"))","v":""},{"$f":"IF(Schedule!C287=\"\",\"\",(Schedule!C287))","v":""},{"$f":"IF(Schedule!D287=\"\",\"\",(Schedule!D287))","v":""},{"$f":"IF(Schedule!E287=\"\",\"\",(Schedule!E287))","v":""}]
[{"$nulls":19},275,"",{"$f":"IF(Schedule!A288=\"\",\"\",(Schedule!A288))","v":""},{"$f":"IF(Schedule!B288=\"\",\"\",TEXT(Schedule!B288,\"HH:MM AM/PM\"))","v":""},{"$f":"IF(Schedule!C288=\"\",\"\",(Schedule!C288))","v":""},{"$f":"IF(Schedule!D288=\"\",\"\",(Schedule!D288))","v":""},{"$f":"IF(Schedule!E288=\"\",\"\",(Schedule!E288))","v":""}]
[{"$nulls":19},276,"",{"$f":"IF(Schedule!A289=\"\",\"\",(Schedule!A289))","v":""},{"$f":"IF(Schedule!B289=\"\",\"\",TEXT(Schedule!B289,\"HH:MM AM/PM\"))","v":""},{"$f":"IF(Schedule!C289=\"\",\"\",(Schedule!C289))","v":""},{"$f":"IF(Schedule!D289=\"\",\"\",(Schedule!D289))","v":""},{"$f":"IF(Schedule!E289=\"\",\"\",(Schedule!E289))","v":""}]
[{"$nulls":19},277,"",{"$f":"IF(Schedule!A290=\"\",\"\",(Schedule!A290))","v":""},{"$f":"IF(Schedule!B290=\"\",\"\",TEXT(Schedule!B290,\"HH:MM AM/PM\"))","v":""},{"$f":"IF(Schedule!C290=\"\",\"\",(Schedule!C290))","v":""},{"$f":"IF(Schedule!D290=\"\",\"\",(Schedule!D290))","v":""},{"$f":"IF(Schedule!E290=\"\",\"\",(Schedule!E290))","v":""}]
[{"$nulls":19},278,"",{"$f":"IF(Schedule!A291=\"\",\"\",(Schedule!A291))","v":""},{"$f":"IF(Schedule!B291=\"\",\"\",TEXT(Schedule!B291,\"HH:MM AM/PM\"))","v":""},{"$f":"IF(Schedule!C291=\"\",\"\",(Schedule!C291))","v":""},{"$f":"IF(Schedule!D291=\"\",\"\",(Schedule!D291))","v":""},{"$f":"IF(Schedule!E291=\"\",\"\",(Schedule!E291))","v":""}]
[{"$nulls":19},279,"",{"$f":"IF(Schedule!A292=\"\",\"\",(Schedule!A292))","v":""},{"$f":"IF(Schedule!B292=\"\",\"\",TEXT(Schedule!B292,\"HH:MM AM/PM\"))","v":""},{"$f":"IF(Schedule!C292=\"\",\"\",(Schedule!C292))","v":""},{"$f":"IF(Schedule!D292=\"\",\"\",(Schedule!D292))","v":""},{"$f":"IF(Schedule!E292=\"\",\"\",(Schedule!E292))","v":""}]
[{"$nulls":19},280,"",{"$f":"IF(Schedule!A293=\"\",\"\",(Schedule!A293))","v":""},{"$f":"IF(Schedule!B293=\"\",\"\",TEXT(Schedule!B293,\"HH:MM AM/PM\"))","v":""},{"$f":"IF(Schedule!C293=\"\",\"\",(Schedule!C293))","v":""},{"$f":"IF(Schedule!D293=\"\",\"\",(Schedule!D293))","v":""},{"$f":"IF(Schedule!E293=\"\",\"\",(Schedule!E293))","v":""}]
[{"$nulls":19},281,"",{"$f":"IF(Schedule!A294=\"\",\"\",(Schedule!A294))","v":""},{"$f":"IF(Schedule!B294=\"\",\"\",TEXT(Schedule!B294,\"HH:MM AM/PM\"))","v":""},{"$f":"IF(Schedule!C294=\"\",\"\",(Schedule!C294))","v":""},{"$f":"IF(Schedule!D294=\"\",\"\",(Schedule!D294))","v":""},{"$f":"IF(Schedule!E294=\"\",\"\",(Schedule!E294))","v":""}]
[{"$nulls":19},282,"",{"$f":"IF(Schedule!A295=\"\",\"\",(Schedule!A295))","v":""},{"$f":"IF(Schedule!B295=\"\",\"\",TEXT(Schedule!B295,\"HH:MM AM/PM\"))","v":""},{"$f":"IF(Schedule!C295=\"\",\"\",(Schedule!C295))","v":""},{"$f":"IF(Schedule!D295=\"\",\"\",(Schedule!D295))","v":""},{"$f":"IF(Schedule!E295=\"\",\"\",(Schedule!E295))","v":""}]
[{"$nulls":19},283,"",{"$f":"IF(Schedule!A296=\"\",\"\",(Schedule!A296))","v":""},{"$f":"IF(Schedule!B296=\"\",\"\",TEXT(Schedule!B296,\"HH:MM AM/PM\"))","v":""},{"$f":"IF(Schedule!C296=\"\",\"\",(Schedule!C296))","v":""},{"$f":"IF(Schedule!D296=\"\",\"\",(Schedule!D296))","v":""},{"$f":"IF(Schedule!E296=\"\",\"\",(Schedule!E296))","v":""}]
[{"$nulls":19},284,"",{"$f":"IF(Schedule!A297=\"\",\"\",(Schedule!A297))","v":""},{"$f":"IF(Schedule!B297=\"\",\"\",TEXT(Schedule!B297,\"HH:MM AM/PM\"))","v":""},{"$f":"IF(Schedule!C297=\"\",\"\",(Schedule!C297))","v":""},{"$f":"IF(Schedule!D297=\"\",\"\",(Schedule!D297))","v":""},{"$f":"IF(Schedule!E297=\"\",\"\",(Schedule!E297))","v":""}]
[{"$nulls":19},285,"",{"$f":"IF(Schedule!A298=\"\",\"\",(Schedule!A298))","v":""},{"$f":"IF(Schedule!B298=\"\",\"\",TEXT(Schedule!B298,\"HH:MM AM/PM\"))","v":""},{"$f":"IF(Schedule!C298=\"\",\"\",(Schedule!C298))","v":""},{"$f":"IF(Schedule!D298=\"\",\"\",(Schedule!D298))","v":""},{"$f":"IF(Schedule!E298=\"\",\"\",(Schedule!E298))","v":""}]
[{"$nulls":19},286,"",{"$f":"IF(Schedule!A299=\"\",\"\",(Schedule!A299))","v":""},{"$f":"IF(Schedule!B299=\"\",\"\",TEXT(Schedule!B299,\"HH:MM AM/PM\"))","v":""},{"$f":"IF(Schedule!C299=\"\",\"\",(Schedule!C299))","v":""},{"$f":"IF(Schedule!D299=\"\",\"\",(Schedule!D299))","v":""},{"$f":"IF(Schedule!E299=\"\",\"\",(Schedule!E299))","v":""}]
[{"$nulls":19},287,"",{"$f":"IF(Schedule!A300=\"\",\"\",(Schedule!A300))","v":""},{"$f":"IF(Schedule!B300=\"\",\"\",TEXT(Schedule!B300,\"HH:MM AM/PM\"))","v":""},{"$f":"IF(Schedule!C300=\"\",\"\",(Schedule!C300))","v":""},{"$f":"IF(Schedule!D300=\"\",\"\",(Schedule!D300))","v":""},{"$f":"IF(Schedule!E300=\"\",\"\",(Schedule!E300))","v":""}]
[{"$nulls":19},288,"",{"$f":"IF(Schedule!A301=\"\",\"\",(Schedule!A301))","v":""},{"$f":"IF(Schedule!B301=\"\",\"\",TEXT(Schedule!B301,\"HH:MM AM/PM\"))","v":""},{"$f":"IF(Schedule!C301=\"\",\"\",(Schedule!C301))","v":""},{"$f":"IF(Schedule!D301=\"\",\"\",(Schedule!D301))","v":""},{"$f":"IF(Schedule!E301=\"\",\"\",(Schedule!E301))","v":""}]
[{"$nulls":19},289,"",{"$f":"IF(Schedule!A302=\"\",\"\",(Schedule!A302))","v":""},{"$f":"IF(Schedule!B302=\"\",\"\",TEXT(Schedule!B302,\"HH:MM AM/PM\"))","v":""},{"$f":"IF(Schedule!C302=\"\",\"\",(Schedule!C302))","v":""},{"$f":"IF(Schedule!D302=\"\",\"\",(Schedule!D302))","v":""},{"$f":"IF(Schedule!E302=\"\",\"\",(Schedule!E302))","v":""}]
[{"$nulls":19},290,"",{"$f":"IF(Schedule!A303=\"\",\"\",(Schedule!A303))","v":""},{"$f":"IF(Schedule!B303=\"\",\"\",TEXT(Schedule!B303,\"HH:MM AM/PM\"))","v":""},{"$f":"IF(Schedule!C303=\"\",\"\",(Schedule!C303))","v":""},{"$f":"IF(Schedule!D303=\"\",\"\",(Schedule!D303))","v":""},{"$f":"IF(Schedule!E303=\"\",\"\",(Schedule!E303))","v":""}]
[{"$nulls":19},291,"",{"$f":"IF(Schedule!A304=\"\",\"\",(Schedule!A304))","v":""},{"$f":"IF(Schedule!B304=\"\",\"\",TEXT(Schedule!B304,\"HH:MM AM/PM\"))","v":""},{"$f":"IF(Schedule!C304=\"\",\"\",(Schedule!C304))","v":""},{"$f":"IF(Schedule!D304=\"\",\"\",(Schedule!D304))","v":""},{"$f":"IF(Schedule!E304=\"\",\"\",(Schedule!E304))","v":""}]
[{"$nulls":19},292,"",{"$f":"IF(Schedule!A305=\"\",\"\",(Schedule!A305))","v":""},{"$f":"IF(Schedule!B305=\"\",\"\",TEXT(Schedule!B305,\"HH:MM AM/PM\"))","v":""},{"$f":"IF(Schedule!C305=\"\",\"\",(Schedule!C305))","v":""},{"$f":"IF(Schedule!D305=\"\",\"\",(Schedule!D305))","v":""},{"$f":"IF(Schedule!E305=\"\",\"\",(Schedule!E305))","v":""}]
[{"$nulls":19},293,"",{"$f":"IF(Schedule!A306=\"\",\"\",(Schedule!A306))","v":""},{"$f":"IF(Schedule!B306=\"\",\"\",TEXT(Schedule!B306,\"HH:MM AM/PM\"))","v":""},{"$f":"IF(Schedule!C306=\"\",\"\",(Schedule!C306))","v":""},{"$f":"IF(Schedule!D306=\"\",\"\",(Schedule!D306))","v":""},{"$f":"IF(Schedule!E306=\"\",\"\",(Schedule!E306))","v":""}]
[{"$nulls":19},294,"",{"$f":"IF(Schedule!A307=\"\",\"\",(Schedule!A307))","v":""},{"$f":"IF(Schedule!B307=\"\",\"\",TEXT(Schedule!B307,\"HH:MM AM/PM\"))","v":""},{"$f":"IF(Schedule!C307=\"\",\"\",(Schedule!C307))","v":""},{"$f":"IF(Schedule!D307=\"\",\"\",(Schedule!D307))","v":""},{"$f":"IF(Schedule!E307=\"\",\"\",(Schedule!E307))","v":""}]
[{"$nulls":19},295,"",{"$f":"IF(Schedule!A308=\"\",\"\",(Schedule!A308))","v":""},{"$f":"IF(Schedule!B308=\"\",\"\",TEXT(Schedule!B308,\"HH:MM AM/PM\"))","v":""},{"$f":"IF(Schedule!C308=\"\",\"\",(Schedule!C308))","v":""},{"$f":"IF(Schedule!D308=\"\",\"\",(Schedule!D308))","v":""},{"$f":"IF(Schedule!E308=\"\",\"\",(Schedule!E308))","v":""}]
[{"$nulls":19},296,"",{"$f":"IF(Schedule!A309=\"\",\"\",(Schedule!A309))","v":""},{"$f":"IF(Schedule!B309=\"\",\"\",TEXT(Schedule!B309,\"HH:MM AM/PM\"))","v":""},{"$f":"IF(Schedule!C309=\"\",\"\",(Schedule!C309))","v":""},{"$f":"IF(Schedule!D309=\"\",\"\",(Schedule!D309))","v":""},{"$f":"IF(Schedule!E309=\"\",\"\",(Schedule!E309))","v":""}]
[{"$nulls":19},297,"",{"$f":"IF(Schedule!A310=\"\",\"\",(Schedule!A310))","v":""},{"$f":"IF(Schedule!B310=\"\",\"\",TEXT(Schedule!B310,\"HH:MM AM/PM\"))","v":""},{"$f":"IF(Schedule!C310=\"\",\"\",(Schedule!C310))","v":""},{"$f":"IF(Schedule!D310=\"\",\"\",(Schedule!D310))","v":""},{"$f":"IF(Schedule!E310=\"\",\"\",(Schedule!E310))","v":""}]
[{"$nulls":19},298,"",{"$f":"IF(Schedule!A311=\"\",\"\",(Schedule!A311))","v":""},{"$f":"IF(Schedule!B311=\"\",\"\",TEXT(Schedule!B311,\"HH:MM AM/PM\"))","v":""},{"$f":"IF(Schedule!C311=\"\",\"\",(Schedule!C311))","v":""},{"$f":"IF(Schedule!D311=\"\",\"\",(Schedule!D311))","v":""},{"$f":"IF(Schedule!E311=\"\",\"\",(Schedule!E311))","v":""}]
[{"$nulls":19},299,"",{"$f":"IF(Schedule!A312=\"\",\"\",(Schedule!A312))","v":""},{"$f":"IF(Schedule!B312=\"\",\"\",TEXT(Schedule!B312,\"HH:MM AM/PM\"))","v":""},{"$f":"IF(Schedule!C312=\"\",\"\",(Schedule!C312))","v":""},{"$f":"IF(Schedule!D312=\"\",\"\",(Schedule!D312))","v":""},{"$f":"IF(Schedule!E312=\"\",\"\",(Schedule!E312))","v":""}]
[{"$nulls":19},300,"",{"$f":"IF(Schedule!A313=\"\",\"\",(Schedule!A313))","v":""},{"$f":"IF(Schedule!B313=\"\",\"\",TEXT(Schedule!B313,\"HH:MM AM/PM\"))","v":""},{"$f":"IF(Schedule!C313=\"\",\"\",(Schedule!C313))","v":""},{"$f":"IF(Schedule!D313=\"\",\"\",(Schedule!D313))","v":""},{"$f":"IF(Schedule!E313=\"\",\"\",(Schedule!E313))","v":""}]

{"sheet":"Schedule","index":2,"n_rows":186,"n_cols":5,"rows_kept":186,"cut":false,"hidden":false,"merged":[]}
["MeetingType","RaceTime","VenueName","MeetingCode","RaceNo"]
["G","2012-12-24T09:01:00","Cambridge","OG",1]
["G","2012-12-24T09:18:00","Cambridge","OG",2]
["G","2012-12-24T09:35:00","Cambridge","OG",3]
["G","2012-12-24T10:05:00","Cambridge","OG",4]
["T","2012-12-24T10:20:00","Cambridge","ZT",1]
["G","2012-12-24T10:35:00","Cambridge","OG",5]
["T","2012-12-24T10:50:00","Cambridge","ZT",2]
["G","2012-12-24T11:04:00","Ballarat","EG",1]
["G","2012-12-24T11:05:00","Cambridge","OG",6]
["T","2012-12-24T11:20:00","Cambridge","ZT",3]
["G","2012-12-24T11:21:00","Ballarat","EG",2]
["G","2012-12-24T11:35:00","Cambridge","OG",7]
["G","2012-12-24T11:38:00","Ballarat","EG",3]
["T","2012-12-24T11:50:00","Cambridge","ZT",4]
["G","2012-12-24T11:55:00","Ballarat","EG",4]
["R","2012-12-24T12:00:00","Sale","VR",1]
["T","2012-12-24T12:04:00","Goulburn","NT",1]
["G","2012-12-24T12:05:00","Cambridge","OG",8]
["R","2012-12-24T12:10:00","Orange","CR",1]
["G","2012-12-24T12:14:00","Ballarat","EG",5]
["T","2012-12-24T12:17:00","Maryborough","VT",1]
["T","2012-12-24T12:20:00","Cambridge","ZT",5]
["R","2012-12-24T12:23:00","Tamworth","NR",1]
["G","2012-12-24T12:33:00","Ballarat","EG",6]
["G","2012-12-24T12:34:00","Cambridge","OG",9]
["R","2012-12-24T12:36:00","Sale","VR",2]
["T","2012-12-24T12:40:00","Goulburn","NT",2]
["R","2012-12-24T12:46:00","Orange","CR",2]
["G","2012-12-24T12:50:00","Ballarat","EG",7]
["T","2012-12-24T12:51:00","Cambridge","ZT",6]
["T","2012-12-24T12:53:00","Maryborough","VT",2]
["R","2012-12-24T12:59:00","Tamworth","NR",2]
["T","2012-12-24T13:03:00","Globe Derby","AT",1]
["G","2012-12-24T13:05:00","Cambridge","OG",10]
["G","2012-12-24T13:09:00","Ballarat","EG",8]
["R","2012-12-24T13:12:00","Sale","VR",3]
["T","2012-12-24T13:16:00","Goulburn","NT",3]
["T","2012-12-24T13:20:00","Cambridge","ZT",7]
["R","2012-12-24T13:22:00","Orange","CR",3]
["G","2012-12-24T13:26:00","Ballarat","EG",9]
["T","2012-12-24T13:29:00","Maryborough","VT",3]
["R","2012-12-24T13:35:00","Tamworth","NR",3]
["T","2012-12-24T13:39:00","Globe Derby","AT",2]
["G","2012-12-24T13:40:00","New Zealand","ZG",1]
["G","2012-12-24T13:45:00","Ballarat","EG",10]
["R","2012-12-24T13:48:00","Sale","VR",4]
["T","2012-12-24T13:52:00","Goulburn","NT",4]
["T","2012-12-24T13:54:00","Cambridge","ZT",8]
["R","2012-12-24T13:58:00","Orange","CR",4]
["G","2012-12-24T14:02:00","Ballarat","EG",11]
["T","2012-12-24T14:05:00","Maryborough","VT",4]
["R","2012-12-24T14:11:00","Tamworth","NR",4]
["T","2012-12-24T14:15:00","Globe Derby","AT",3]
["G","2012-12-24T14:16:00","New Zealand","ZG",2]
["G","2012-12-24T14:21:00","Ballarat","EG",12]
["R","2012-12-24T14:25:00","Sale","VR",5]
["T","2012-12-24T14:30:00","Goulburn","NT",5]
["T","2012-12-24T14:30:00","Cambridge","ZT",9]
["R","2012-12-24T14:35:00","Orange","CR",5]
["T","2012-12-24T14:40:00","Maryborough","VT",5]
["T","2012-12-24T14:45:00","Pinjarra","PT",1]
["G","2012-12-24T14:45:00","New Zealand","ZG",3]
["R","2012-12-24T14:50:00","Tamworth","NR",5]
["T","2012-12-24T14:55:00","Globe Derby","AT",4]
["R","2012-12-24T15:00:00","Sale","VR",6]
["T","2012-12-24T15:03:00","Goulburn","NT",6]
["T","2012-12-24T15:05:00","Cambridge","ZT",10]
["G","2012-12-24T15:07:00","Cranbourne","VG",1]
["R","2012-12-24T15:10:00","Orange","CR",6]
["T","2012-12-24T15:13:00","Maryborough","VT",6]
["G","2012-12-24T15:17:00","Bathurst","NG",1]
["T","2012-12-24T15:20:00","Pinjarra","PT",2]
["G","2012-12-24T15:20:00","New Zealand","ZG",4]
["R","2012-12-24T15:25:00","Tamworth","NR",6]
["G","2012-12-24T15:29:00","Cranbourne","VG",2]
["T","2012-12-24T15:32:00","Globe Derby","AT",5]
["G","2012-12-24T15:37:00","Bathurst","NG",2]
["R","2012-12-24T15:40:00","Sale","VR",7]
["T","2012-12-24T15:43:00","Goulburn","NT",7]
["G","2012-12-24T15:47:00","Cranbourne","VG",3]
["R","2012-12-24T15:50:00","Orange","CR",7]
["G","2012-12-24T15:50:00","New Zealand","ZG",5]
["T","2012-12-24T15:53:00","Maryborough","VT",7]
["G","2012-12-24T15:57:00","Bathurst","NG",3]
["T","2012-12-24T16:00:00","Pinjarra","PT",3]
["R","2012-12-24T16:05:00","Tamworth","NR",7]
["G","2012-12-24T16:09:00","Cranbourne","VG",4]
["G","2012-12-24T16:10:00","New Zealand","ZG",6]
["T","2012-12-24T16:12:00","Globe Derby","AT",6]
["G","2012-12-24T16:17:00","Bathurst","NG",4]
["R","2012-12-24T16:20:00","Sale","VR",8]
["T","2012-12-24T16:23:00","Goulburn","NT",8]
["G","2012-12-24T16:27:00","Cranbourne","VG",5]
["G","2012-12-24T16:27:00","New Zealand","ZG",7]
["T","2012-12-24T16:33:00","Maryborough","VT",8]
["G","2012-12-24T16:37:00","Bathurst","NG",5]
["T","2012-12-24T16:40:00","Pinjarra","PT",4]
["G","2012-12-24T16:44:00","New Zealand","ZG",8]
["G","2012-12-24T16:49:00","Cranbourne","VG",6]
["T","2012-12-24T16:52:00","Globe Derby","AT",7]
["G","2012-12-24T16:57:00","Bathurst","NG",6]
["T","2012-12-24T17:00:00","Goulburn","NT",9]
["G","2012-12-24T17:02:00","New Zealand","ZG",9]
["G","2012-12-24T17:05:00","Cranbourne","VG",7]
["T","2012-12-24T17:08:00","Maryborough","VT",9]
["G","2012-12-24T17:13:00","Bathurst","NG",7]
["T","2012-12-24T17:16:00","Pinjarra","PT",5]
["G","2012-12-24T17:21:00","New Zealand","ZG",10]
["G","2012-12-24T17:22:00","Cranbourne","VG",8]
["G","2012-12-24T17:32:00","Bathurst","NG",8]
["G","2012-12-24T17:37:00","Angle Park","AG",1]
["T","2012-12-24T17:41:00","Pinjarra","PT",6]
["G","2012-12-24T17:47:00","Cranbourne","VG",9]
["G","2012-12-24T17:52:00","Bathurst","NG",9]
["G","2012-12-24T17:57:00","Angle Park","AG",2]
["G","2012-12-24T18:02:00","Cranbourne","VG",10]
["T","2012-12-24T18:06:00","Pinjarra","PT",7]
["G","2012-12-24T18:11:00","Shepparton","MG",1]
["G","2012-12-24T18:14:00","Bulli","SG",1]
["G","2012-12-24T18:17:00","Bathurst","NG",10]
["G","2012-12-24T18:20:00","Angle Park","AG",3]
["G","2012-12-24T18:23:00","Cranbourne","VG",11]
["G","2012-12-24T18:27:00","Shepparton","MG",2]
["G","2012-12-24T18:30:00","Bulli","SG",2]
["T","2012-12-24T18:33:00","Pinjarra","PT",8]
["G","2012-12-24T18:38:00","Angle Park","AG",4]
["G","2012-12-24T18:41:00","Launceston","TG",1]
["G","2012-12-24T18:44:00","Albion Park","BG",1]
["G","2012-12-24T18:47:00","Cranbourne","VG",12]
["G","2012-12-24T18:50:00","Shepparton","MG",3]
["G","2012-12-24T18:54:00","Bulli","SG",3]
["G","2012-12-24T18:58:00","Angle Park","AG",5]
["T","2012-12-24T19:00:00","Pinjarra","PT",9]
["G","2012-12-24T19:05:00","Launceston","TG",2]
["G","2012-12-24T19:08:00","Albion Park","BG",2]
["G","2012-12-24T19:11:00","Shepparton","MG",4]
["G","2012-12-24T19:14:00","Bulli","SG",4]
["G","2012-12-24T19:17:00","Mandurah","PG",1]
["G","2012-12-24T19:20:00","Angle Park","AG",6]
["G","2012-12-24T19:23:00","Launceston","TG",3]
["G","2012-12-24T19:26:00","Albion Park","BG",3]
["G","2012-12-24T19:29:00","Shepparton","MG",5]
["G","2012-12-24T19:32:00","Bulli","SG",5]
["G","2012-12-24T19:35:00","Mandurah","PG",2]
["G","2012-12-24T19:38:00","Angle Park","AG",7]
["G","2012-12-24T19:42:00","Launceston","TG",4]
["G","2012-12-24T19:46:00","Albion Park","BG",4]
["G","2012-12-24T19:49:00","Shepparton","MG",6]
["G","2012-12-24T19:52:00","Bulli","SG",6]
["G","2012-12-24T19:55:00","Mandurah","PG",3]
["G","2012-12-24T19:58:00","Angle Park","AG",8]
["G","2012-12-24T20:02:00","Launceston","TG",5]
["G","2012-12-24T20:06:00","Albion Park","BG",5]
["G","2012-12-24T20:09:00","Shepparton","MG",7]
["G","2012-12-24T20:12:00","Bulli","SG",7]
["G","2012-12-24T20:15:00","Mandurah","PG",4]
["G","2012-12-24T20:18:00","Angle Park","AG",9]
["G","2012-12-24T20:22:00","Launceston","TG",6]
["G","2012-12-24T20:25:00","Albion Park","BG",6]
["G","2012-12-24T20:28:00","Shepparton","MG",8]
["G","2012-12-24T20:32:00","Bulli","SG",8]
["G","2012-12-24T20:35:00","Mandurah","PG",5]
["G","2012-12-24T20:38:00","Angle Park","AG",10]
["G","2012-12-24T20:42:00","Launceston","TG",7]
["G","2012-12-24T20:45:00","Albion Park","BG",7]
["G","2012-12-24T20:48:00","Shepparton","MG",9]
["G","2012-12-24T20:52:00","Bulli","SG",9]
["G","2012-12-24T20:55:00","Mandurah","PG",6]
["G","2012-12-24T20:58:00","Angle Park","AG",11]
["G","2012-12-24T21:02:00","Launceston","TG",8]
["G","2012-12-24T21:05:00","Albion Park","BG",8]
["G","2012-12-24T21:08:00","Shepparton","MG",10]
["G","2012-12-24T21:12:00","Bulli","SG",10]
["G","2012-12-24T21:15:00","Mandurah","PG",7]
["G","2012-12-24T21:20:00","Launceston","TG",9]
["G","2012-12-24T21:25:00","Albion Park","BG",9]
["G","2012-12-24T21:30:00","Shepparton","MG",11]
["G","2012-12-24T21:35:00","Mandurah","PG",8]
["G","2012-12-24T21:40:00","Launceston","TG",10]
["G","2012-12-24T21:44:00","Albion Park","BG",10]
["G","2012-12-24T21:48:00","Shepparton","MG",12]
["G","2012-12-24T21:52:00","Mandurah","PG",9]
["G","2012-12-24T22:07:00","Mandurah","PG",10]
["G","2012-12-24T22:24:00","Mandurah","PG",11]
["G","2012-12-24T22:40:00","Mandurah","PG",12]

{"sheet":"Start here","index":3,"n_rows":25,"n_cols":3,"rows_kept":25,"cut":false,"hidden":false,"merged":[]}
[]
[null,"Instructions/Notes"]
[null,"1) Enter a Date in cell A1 in the Review Worksheet"]
[]
[null,"2) In cell B2, select which Race Types you wish to see loaded (R = Horses, G = Greyhounds, RG = Both Greyhounds and Horses)"]
[]
[null,"3) Click the 'Load Races' button and the day's races will appear in the left-hand navigation panel"]
[]
[null,"4) Click on a Race to retrieve race details"]
[]
[null,"5) Sort of Fields as needed"]
[]
[null,"6) if you wish to update only the prices, click the big red 'Update' button in the Review Worksheet"]
[]
[null,"Things to watch out for"]
[null,"1) Sometimes there is a discrepancy between the two tote's Venue Names (Morphettville Park vs. Morphettville, or Sandown-Lakeside vs. Sandown)"]
[null,null,"If this happens and you cannot see a Venue in the Race List navigation panel, , just go to Columns AJ or AD in the Racecard Worksheet, clean up the Venue Names so they match then"]
[null,null," click the 'Reload Races' Button in the Review Worksheet"]
[null,null,"This will reload the Races in the Race List navigation Panel"]
[]
[null,"2) I have not had time to fully test this, but given there are quite a few Excel guns on this forum, I am sure they fix what needs fixing if a bug or error is found."]
[]
[null,"3) If a meeting is abandoned, it will pop up a message saying so. Click OK and move on to a different race. Today( 27/01/2012), you will see this if you click on Ipswich races"]
[]
[null,"4) Enjoy!"]